program: Gaussian 09
title: 000151517
version: EM64L-G09RevD.01
frameworkgroup: C1[X(C6H6ClNO)]
method: RPBEPBE
basis: SDD
operation: Freq
keyword: #p
keyword: freq=noraman
keyword: PBEPBE/SDD
title: #p freq=noraman PBEPBE/SDD
converged: NO YES NO NO
title: Mulliken charges:
elementType: Cl O N C C C C C C H H H H H H
charge: -0.075288 -0.409150 -0.366028 0.519741 -0.300964 -0.341572 -0.219086 -0.206056 -0.247910 0.255987 0.252520 0.228697 0.233323 0.305994 0.369793
chargesum: 0.00000
title: Mulliken charges with hydrogens summed into heavy atoms:
elementType: Cl O N C C C C C C
charge: -0.075288 -0.039357 -0.060034 0.519741 -0.300964 -0.085585 0.033434 0.022641 -0.014588
polarizability: 1.11179083e+02 -3.43935615e+00 1.02664690e+02 -3.20099182e+00 -1.34064645e+00 3.60278549e+01
1716.lowfreq: -7.2175 -4.8196 -0.0030 -0.0022 -0.0021 8.5704 100.5983 145.3939 185.3898
frequency: 100.5974 145.3923 185.3894 238.3393 277.9982 353.8694 380.6531 432.9149 472.1257 530.0300 576.1862 645.2898 685.9617 702.3590 750.1197 843.9111 847.9392 929.3984 968.5133 973.8003 1010.6784 1034.7256 1122.9193 1167.1427 1233.1291 1283.9010 1324.8677 1364.7344 1420.5831 1447.7506 1467.1970 1578.0570 1610.4438 3138.8270 3155.3168 3172.1956 3181.6458 3442.0039 3518.7914
redmass: 4.4697 4.8207 8.2957 4.6932 5.0526 1.2913 7.1965 3.2991 5.3516 3.3417 4.7396 2.8763 4.0053 4.0372 1.2431 2.7180 1.4413 1.3670 3.0566 1.4730 6.9298 1.9205 1.5317 1.0584 1.6019 1.5378 1.5095 2.8186 2.1880 1.8458 2.5848 5.7376 7.0780 1.0862 1.0907 1.0956 1.0980 1.0769 1.0685
irintensity: 0.9732 2.1507 2.8266 11.5471 1.8434 83.8752 3.5001 9.1930 0.6523 29.8298 38.3034 163.7818 62.1488 6.9225 106.5124 28.1368 5.6134 2.6965 42.5747 10.2613 44.3901 3.1897 6.3663 0.1296 10.5684 6.6961 82.7831 20.4356 0.8853 11.5382 90.7605 6.9757 36.6509 4.2689 9.6392 9.8675 8.1795 15.3156 27.2907
temp: 298.150 k
press: 1.00000 atm
elementType: 17 8 7 6 6 6 6 6 6 1 1 1 1 1 1
symmnumber: 1
zpe: 285403.3 jmol-1
zpe.correction: 0.108704 hartree
zpe.thermalcorrener: 0.116947 hartree
zpe.thermalcorrenthalpy: 0.117892 hartree
zpe.thermalcorrgfe: 0.075357 hartree
zpe.sumelectzpe: -821.558035 hartree
zpe.sumelectthermal: -821.549792 hartree
zpe.sumelectthermalent: -821.548848 hartree
zpe.sumelectthermalfe: -821.591382 hartree
dipole: -0.1392 -1.3406 0.7216
dipole: 1.5289
quadrupole: -49.0999 -55.7487 -63.5344
quadrupole: 1.6080 -3.1769 -3.5367
quadrupole: 7.0278 0.3789 -7.4067 1.6080 -3.1769 -3.5367
hfenergy: -821.6667396 hartree
pointgroup: C01 [X(C6H6Cl1N1O1)]
dipole: 0.1478793 0.5062604 0.2892058 debye
dipolederiv: -0.2058451 0.1719555 0.0053417 0.1530856 -0.7219503 -0.0098779 0.0012094 -0.0129232 -0.0710396 -0.6739662 0.0036746 0.0688857 -0.1637858 -0.3641022 -0.0420024 0.375903 0.0074075 0.010057 -0.6311804 0.2498038 -0.1799446 0.5113481 0.0461171 0.117805 -0.7274009 0.1206245 -0.3366782 1.0533325 -0.061533 0.1551956 -0.3204162 -0.2688588 -0.0234002 0.1748535 -0.0145909 0.1152701 -0.1350162 -0.1671351 -0.0228559 -0.3822474 1.0147114 -0.0013575 0.031417 0.021088 -0.110436 -0.1892958 -0.0964466 -0.0178863 0.3018135 -0.0083096 0.0310626 -0.0324778 -0.0177966 -0.1997753 0.0587779 -0.0381188 0.0195902 0.0660022 -0.1017539 0.0014443 0.0041936 -0.0123875 -0.0789746 0.125736 0.0801661 0.0259467 -0.040413 0.1507804 -0.0034067 0.026085 0.0004479 -0.1339575 -0.0554762 -0.0052747 0.0013415 -0.0289038 -0.1528362 -0.0021678 0.0091096 0.0014656 -0.2082187 0.0370628 -0.0697374 -0.0134192 -0.0593613 0.0030297 -0.0055819 -0.0189776 0.0001037 0.171532 0.042269 -0.0703075 -0.007505 -0.0836784 0.0101761 -0.0085959 -0.0112578 -0.0031594 0.1643549 0.0683004 0.0567252 -0.0035137 0.0689435 -0.1023605 0.0016951 -0.0022703 0.0028437 0.1596501 -0.1023803 0.0436385 -0.0134091 0.0438446 0.0600396 0.0011889 -0.0146757 0.0016172 0.1742927 0.2120901 -0.0653118 0.0356573 -0.0437541 0.1545995 -0.0577647 0.2162633 -0.0905807 0.2613681 0.3955915 -0.0320987 -0.053425 -0.0224776 0.2807177 0.0009592 -0.0319744 -0.0041599 0.082555 unknown
polarizability: 109.4685675|-4.8036372|104.2254474|4.6552272|0.988971|36.177613 unknown
InChI: InChI=1S/C6H6ClNO/c7-5-3-1-2-4-6(5)8-9/h1-4,8-9H
charge 0 multiplicity 1
15 atoms
Cl 0.160241 -2.739656 0.012289
O  2.867016 0.747877 -0.16814
N  1.941478 -0.300072 0.281271
C  0.574237 0.034019 0.116681
C  -0.40492 -0.991763 0.035925
C  0.121702 1.380466 0.101917
C  -1.778994 -0.71664 -0.035103
C  -1.256281 1.66954 0.026543
C  -2.213739 0.629994 -0.035973
H  0.867053 2.179602 0.124517
H  -2.495772 -1.541181 -0.09312
H  -1.583109 2.714917 0.012352
H  -3.283146 0.855235 -0.091746
H  2.225668 -1.193928 -0.144163
H  3.335664 1.01369 0.667449
