program: Gaussian 09
title: 000151515
version: EM64L-G09RevD.01
frameworkgroup: C1[X(C15H9ClO2)]
method: RPBEPBE
basis: SDD
operation: Freq
keyword: #p
keyword: freq=noraman
keyword: PBEPBE/SDD
title: #p freq=noraman PBEPBE/SDD
converged: YES YES NO NO
title: Mulliken charges:
elementType: Cl O O C C C C C C C C C C C C C C C H H H H H H H H H
charge: -0.039556 -0.298832 -0.246162 0.191493 0.251140 0.185610 0.351713 0.136803 -0.419329 -0.354275 -0.354553 -0.362248 -0.343460 -0.246813 -0.207476 -0.214396 -0.208623 -0.117771 0.247344 0.282226 0.260205 0.237074 0.273271 0.238372 0.237734 0.261032 0.259478
chargesum: 0.00000
title: Mulliken charges with hydrogens summed into heavy atoms:
elementType: Cl O O C C C C C C C C C C C C C C C
charge: -0.039556 -0.298832 -0.246162 0.191493 0.251140 0.185610 0.351713 0.136803 -0.171985 -0.072050 -0.094348 -0.125174 -0.070189 -0.008441 0.030259 0.046635 0.050854 -0.117771
polarizability: 3.31293239e+02 6.55846427e+00 1.89853521e+02 -3.17132176e-01 6.06003982e-01 6.55954951e+01
1716.lowfreq: -6.4356 -4.9967 -2.5995 0.0017 0.0028 0.0029 18.5131 41.4623 83.0536
frequency: 18.1037 41.4513 83.0520 97.6337 143.4585 156.1756 214.4820 237.7416 246.7433 284.4879 309.8307 363.6544 404.5294 427.1604 431.3220 479.1624 489.9535 503.9796 519.1549 578.6989 600.7907 625.7070 633.6693 663.7632 696.0226 722.1735 734.4865 758.8678 782.2096 827.5483 828.8904 844.7378 869.3252 872.5117 884.9748 963.1634 972.1493 980.0804 988.2442 1002.4691 1004.9790 1027.6807 1075.2257 1078.7671 1117.1999 1128.8769 1163.7483 1194.1175 1200.6382 1241.3249 1257.2015 1284.8092 1301.4717 1324.9475 1374.8839 1399.5446 1404.3746 1446.9719 1461.9007 1477.0388 1552.1208 1570.0946 1578.9811 1601.7267 1614.8342 1623.1825 3140.4480 3152.8044 3154.2178 3165.4808 3165.8319 3176.1717 3176.4259 3187.3860 3188.6514
redmass: 3.9521 8.3588 7.8353 6.7346 7.2006 4.4649 10.5203 8.1985 6.4106 7.3099 6.4064 5.3250 2.8792 3.3877 9.7130 3.4098 7.7186 8.5530 3.6070 7.6853 6.4399 7.1493 5.2540 3.0649 7.2109 3.2808 5.7256 2.6179 1.4244 1.5359 3.7260 1.5125 1.5860 6.9645 1.5398 1.3698 1.3689 1.3640 6.0456 1.3328 3.6048 2.0910 3.1721 3.0500 1.3609 1.6784 1.2097 1.1395 2.5899 2.2390 1.6190 2.2403 1.2880 3.5603 6.0790 9.4233 3.8358 2.6527 2.6786 2.4582 10.0400 6.7296 7.7883 6.0908 7.4531 7.3890 1.0862 1.0901 1.0886 1.0895 1.0954 1.0969 1.1002 1.0949 1.0925
irintensity: 0.3357 0.0456 0.5560 3.6295 0.5286 2.7180 1.6343 1.1594 0.2616 5.0476 0.3493 3.6281 0.0114 0.5101 15.2906 18.3686 1.8248 8.9586 6.6189 10.3005 4.2846 0.8804 3.8611 5.9015 14.5422 1.7611 1.0982 18.6877 84.3458 5.7427 5.3637 79.7719 11.5821 22.3667 2.3613 0.3290 2.8663 0.5441 50.6103 0.1831 25.4772 18.9766 16.0166 62.9003 14.8701 27.4805 0.5747 10.0110 48.6827 0.8588 9.7356 25.8698 7.2829 287.1786 63.7658 5.5197 33.2950 63.6628 12.2259 93.3246 139.5524 40.6157 4.9349 77.4830 231.7205 87.6552 3.3985 4.1046 3.6602 1.9209 10.8823 1.9627 20.1621 1.5023 4.0530
temp: 298.150 k
press: 1.00000 atm
elementType: 17 8 8 6 6 6 6 6 6 6 6 6 6 6 6 6 6 6 1 1 1 1 1 1 1 1 1
symmnumber: 1
zpe: 510187.1 jmol-1
zpe.correction: 0.194320 hartree
zpe.thermalcorrener: 0.208372 hartree
zpe.thermalcorrenthalpy: 0.209316 hartree
zpe.thermalcorrgfe: 0.151478 hartree
zpe.sumelectzpe: -1186.285906 hartree
zpe.sumelectthermal: -1186.271855 hartree
zpe.sumelectthermalent: -1186.270910 hartree
zpe.sumelectthermalfe: -1186.328748 hartree
dipole: -0.1545 -3.5295 0.0441
dipole: 3.5331
quadrupole: -109.2036 -107.7949 -115.0976
quadrupole: -18.3939 0.0981 0.5042
quadrupole: 1.4951 2.9038 -4.3989 -18.3939 0.0981 0.5042
hfenergy: -1186.4802262 hartree
pointgroup: C01 [X(C15H9Cl1O2)]
dipole: 0.0146086 1.3835474 0.1334636 debye
polarizability: 330.6974516|11.102977|189.6665665|2.0935279|9.8412825|66.3782365 unknown
InChI: InChI=1S/C15H9ClO2/c16-11-7-5-10(6-8-11)15-9-13(17)12-3-1-2-4-14(12)18-15/h1-9H
charge 0 multiplicity 1
27 atoms
Cl 6.255242 0.653896 0.051866
O  -0.508077 0.793292 0.057313
O  -2.442754 -2.89588 -0.306017
C  -2.617115 -0.484969 -0.073851
C  0.228214 -0.397879 -0.054551
C  -1.917452 0.7427 0.046039
C  1.685293 -0.150671 -0.026647
C  -1.863822 -1.763921 -0.194458
C  -0.406764 -1.616589 -0.176417
C  -4.035889 -0.453264 -0.076753
C  -2.587344 1.97905 0.161912
C  2.614001 -1.228184 -0.061569
C  2.187503 1.1789 0.035657
C  -4.722259 0.767523 0.037179
C  -3.994892 1.983914 0.156663
C  4.00115 -0.98962 -0.038177
C  3.573741 1.431031 0.059495
C  4.464082 0.3408 0.021568
H  0.177955 -2.533858 -0.270483
H  -4.560817 -1.40963 -0.170819
H  -2.007196 2.901796 0.253233
H  2.264872 -2.264179 -0.102762
H  1.484666 2.01482 0.064234
H  -5.816765 0.786385 0.034497
H  -4.53075 2.934848 0.245846
H  4.710057 -1.821794 -0.064049
H  3.953619 2.455382 0.10595
