program: Gaussian 09
title: 000151512
version: EM64L-G09RevD.01
frameworkgroup: C1[X(C18H34O2)]
method: RPBEPBE
basis: SDD
operation: Freq
keyword: #pfreq=noraman
keyword: PBEPBE/SDD
title: #p freq=noraman PBEPBE/SDD
converged: YES YES NO NO
title: Mulliken charges:
elementType: O O C C C C C C C C C C C C C C C C C C H H H H H H H H H H H H H H H H H H H H H H H H H H H H H H H H H H
charge: -0.418383 -0.230769 -0.385041 -0.383429 -0.385147 -0.385236 -0.374868 -0.368638 -0.378866 -0.376236 -0.458979 -0.487792 -0.202515 -0.366256 -0.455553 -0.342525 -0.201419 -0.356754 0.170658 -0.694420 0.194165 0.194304 0.193305 0.193096 0.192339 0.194635 0.196530 0.196302 0.194556 0.190446 0.191168 0.191379 0.210034 0.194156 0.217258 0.218337 0.205518 0.195136 0.252008 0.252295 0.224105 0.190353 0.205869 0.203552 0.194196 0.188266 0.184757 0.224514 0.194326 0.195935 0.209629 0.209588 0.215226 0.374887
chargesum: 0.00000
title: Mulliken charges with hydrogens summed into heavy atoms:
elementType: O O C C C C C C C C C C C C C C C C C C
charge: -0.043496 -0.230769 0.003428 0.002973 0.001827 0.007596 0.010134 0.013909 0.025323 0.059358 -0.058325 0.016511 0.021591 0.029965 -0.057806 0.030498 0.023094 0.033507 0.170658 -0.059977
polarizability: 2.84083933e+02 8.64763725e+00 1.78901097e+02 -3.91568162e+00 4.41101422e+00 1.61205353e+02
1716.lowfreq: -8.5044 -2.2380 -0.0021 -0.0003 0.0015 6.6153 9.2783 11.7343 20.9504
frequency: 5.7499 11.5556 18.9664 26.4953 36.1597 39.8190 48.3762 56.8124 66.6529 77.9053 86.7457 91.6843 112.8326 117.6517 119.1755 126.7529 133.7756 146.9214 148.7292 158.1146 179.0108 210.9037 232.3226 246.1694 270.8964 318.4967 340.3208 350.5703 412.9799 428.6356 463.9391 483.6833 498.7887 500.8757 541.7280 588.2055 636.9025 718.9215 721.6405 723.6836 728.2683 746.3128 750.3052 779.5440 801.8530 827.9678 840.3602 856.3065 883.6350 891.1595 934.9950 952.8380 974.6129 980.5788 985.0517 997.5430 1001.6880 1015.8257 1022.7638 1030.3414 1041.4510 1053.1249 1065.4328 1069.1438 1076.5075 1081.4403 1082.9795 1083.0725 1102.8244 1107.1898 1113.2094 1115.8219 1165.5075 1191.3542 1197.8698 1202.3359 1219.7345 1224.9567 1233.6809 1244.3070 1246.5450 1252.6372 1264.9612 1267.6451 1276.7046 1280.4907 1282.3939 1284.5381 1285.7522 1288.6428 1292.8500 1292.9500 1293.9005 1298.9407 1311.1977 1324.8860 1336.0799 1344.8369 1349.1052 1352.6416 1354.4871 1357.6738 1372.1404 1387.5873 1436.5398 1456.4928 1456.9098 1459.9458 1461.0393 1463.2514 1463.8871 1464.8244 1469.6299 1470.8605 1477.1976 1477.8552 1479.4912 1483.8798 1487.4392 1488.0186 1670.6797 1685.1861 2947.1719 2948.2056 2948.4892 2949.2966 2950.7984 2951.5650 2952.4386 2956.7077 2962.9436 2963.0481 2966.6810 2969.7052 2971.7581 2982.2961 2985.4715 2986.3695 2991.0184 2992.2233 2995.0208 3000.7791 3005.4328 3008.8048 3020.6757 3021.1180 3029.2585 3035.6837 3040.8792 3043.2527 3059.1792 3061.1142 3068.5399 3069.5291 3070.3773 3511.4822
redmass: 7.3587 4.7291 4.2590 4.2729 1.8901 2.3494 2.2163 3.1837 2.2108 2.4782 2.7155 2.4858 2.2287 2.2721 2.5850 2.0681 3.2682 2.0540 2.1431 2.2939 3.5961 2.9846 1.1146 3.3486 4.2954 3.4421 3.4341 3.0649 3.3841 3.4454 2.8656 3.1453 2.1069 2.4946 2.4848 4.6588 1.3162 1.0603 1.0751 1.0690 1.1112 1.1670 1.1456 1.2697 1.5543 1.3410 1.3685 4.8529 1.5472 1.6009 1.4638 1.2769 1.1100 3.8299 4.2590 1.9991 2.4923 3.2015 1.4770 2.7742 3.1913 2.8785 1.4169 2.6311 2.2988 2.1316 2.3062 2.1912 2.4370 3.5222 2.2241 1.4495 2.1054 1.6870 1.3638 1.3882 1.4240 1.3224 1.3106 1.3870 1.3215 1.2518 1.3619 1.2200 1.0852 1.1071 1.2452 1.0709 1.1253 1.1035 1.1167 1.1619 1.2795 1.2125 1.3647 1.3968 1.4684 1.5039 1.5910 1.6363 1.6675 1.6459 1.8358 1.2141 1.0847 1.0840 1.0850 1.0760 1.0703 1.0698 1.0647 1.0814 1.0753 1.0950 1.0427 1.0992 1.0755 1.1005 1.0860 1.1007 8.2533 6.6028 1.0606 1.0605 1.0602 1.0595 1.0594 1.0594 1.0587 1.0597 1.0596 1.0599 1.0598 1.0581 1.0377 1.0963 1.0614 1.0975 1.0968 1.0994 1.0596 1.0994 1.0973 1.1009 1.1033 1.1025 1.1003 1.1038 1.1035 1.1038 1.0943 1.1031 1.0979 1.0906 1.0992 1.0639
irintensity: 1.1073 0.0867 0.0465 0.1574 0.0239 0.0172 0.0153 0.1794 0.1703 0.0417 0.1832 0.0778 0.0976 0.0839 0.4246 0.0307 0.2412 0.0716 0.0128 0.0695 0.3710 1.6736 0.0047 0.3762 2.1806 1.9529 0.6130 1.4834 1.8667 7.9520 4.1336 5.6053 22.6257 21.6834 0.8302 14.1169 128.4543 15.8290 5.2540 10.8612 6.9214 0.4883 0.2824 3.9520 0.3938 1.4799 2.1871 1.3116 5.6490 1.3024 0.1524 1.8915 46.4725 29.4077 10.3044 12.3858 3.2288 69.1498 3.4336 82.3852 33.8208 24.7383 19.7487 30.4168 2.1467 0.0717 0.1241 2.6183 5.2606 16.5104 5.1382 0.8990 1.0623 0.0861 20.0087 18.0684 0.2156 2.4078 0.8591 1.4572 0.1741 0.5192 4.6418 1.0822 0.1916 0.2618 7.9387 0.2964 2.3670 1.4133 0.0636 2.0303 3.2697 0.5798 7.5550 12.4808 3.4151 3.3673 4.3795 0.5839 1.8370 2.6584 31.0219 11.2515 27.8987 1.7640 3.0989 0.0104 0.6810 0.2961 0.3081 0.7958 1.6131 0.3096 12.2715 5.6073 3.7668 0.3959 20.2650 34.1637 208.6494 0.0179 12.0361 13.5836 8.4119 7.8190 11.6942 0.9503 13.3985 0.4752 32.3907 3.8645 206.1186 128.4360 31.3169 0.4756 5.3845 2.0950 2.8037 1.5553 40.6139 5.7495 3.7557 1.2721 1.9484 2.3729 2.3409 8.3056 90.1427 194.3159 4.0732 91.3940 36.2708 150.6639 59.5384 17.6879
temp: 298.150 k
press: 1.00000 atm
elementType: 8 8 6 6 6 6 6 6 6 6 6 6 6 6 6 6 6 6 6 6 1 1 1 1 1 1 1 1 1 1 1 1 1 1 1 1 1 1 1 1 1 1 1 1 1 1 1 1 1 1 1 1 1 1
symmnumber: 1
zpe: 1267105.4 jmol-1
zpe.correction: 0.482615 hartree
zpe.thermalcorrener: 0.508967 hartree
zpe.thermalcorrenthalpy: 0.509912 hartree
zpe.thermalcorrgfe: 0.418035 hartree
zpe.sumelectzpe: -855.115582 hartree
zpe.sumelectthermal: -855.089230 hartree
zpe.sumelectthermalent: -855.088286 hartree
zpe.sumelectthermalfe: -855.180162 hartree
dipole: 0.6757 1.3399 0.6166
dipole: 1.6224
quadrupole: -133.5637 -131.5593 -124.8763
quadrupole: -10.4439 -6.7718 -2.5747
quadrupole: -3.5639 -1.5595 5.1234 -10.4439 -6.7718 -2.5747
hfenergy: -855.5981973 hartree
pointgroup: C01 [X(C18H34O2)]
dipole: 0.262834 0.5321444 0.2348528 debye
polarizability: 284.0282285|9.0357843|179.1159709|-3.7218432|4.1326729|161.0461839 unknown
InChI: InChI=1S/C18H34O2/c1-2-3-4-5-6-7-8-9-10-11-12-13-14-15-16-17-18(19)20/h6-7,19H,2-5,8-17H2,1H3
charge 0 multiplicity 1
54 atoms
O  -10.35831 1.701546 0.130696
O  -9.744837 -0.376186 -0.702472
C  -1.876075 -0.930308 -0.102015
C  -2.98589 0.084396 0.254062
C  -0.461123 -0.453881 0.29723
C  -4.40206 -0.395895 -0.135041
C  0.651671 -1.459786 -0.073796
C  -5.509001 0.623986 0.21439
C  2.062081 -0.991864 0.350066
C  -6.921462 0.135815 -0.175392
C  3.178432 -1.993783 -0.050913
C  -8.010341 1.165815 0.179628
C  4.546616 -1.589673 0.457534
C  7.447555 0.471531 -0.350533
C  6.994521 -0.910495 0.193442
C  8.868086 0.864012 0.114282
C  5.632402 -1.331058 -0.318054
C  9.323074 2.244486 -0.411892
C  -9.409106 0.712002 -0.187358
C  10.744434 2.627702 0.054547
H  -1.900414 -1.131762 -1.193516
H  -2.090561 -1.898684 0.396808
H  -2.774093 1.049842 -0.251714
H  -2.955962 0.292222 1.344331
H  -0.434203 -0.264472 1.390925
H  -0.250993 0.520587 -0.19132
H  -4.615922 -1.35819 0.375076
H  -4.430629 -0.609021 -1.223928
H  0.636905 -1.635245 -1.169935
H  0.434471 -2.440188 0.400176
H  -5.477356 0.837845 1.303581
H  -5.293452 1.585389 -0.297779
H  2.282022 -0.004817 -0.104003
H  2.083645 -0.841645 1.449577
H  -6.958438 -0.079709 -1.260541
H  -7.142018 -0.822345 0.333053
H  3.203343 -2.097816 -1.153868
H  2.909194 -2.992337 0.356068
H  -8.003718 1.392882 1.264299
H  -7.824483 2.134078 -0.325575
H  4.644912 -1.494286 1.551979
H  7.414643 0.456753 -1.459921
H  6.720716 1.243554 -0.026873
H  6.987775 -0.886803 1.301293
H  7.754784 -1.664883 -0.103233
H  8.904656 0.865845 1.223954
H  9.590569 0.089125 -0.218474
H  5.533792 -1.41894 -1.413047
H  9.283826 2.242699 -1.520428
H  8.601235 3.017166 -0.077085
H  10.80227 2.663696 1.158955
H  11.489141 1.887743 -0.295104
H  11.045477 3.61883 -0.332068
H  -11.264701 1.373122 -0.119075
