program: Gaussian 09
title: 000151507
version: EM64L-G09RevD.01
frameworkgroup: C1[X(C14H24O2)]
method: RPBEPBE
basis: SDD
operation: Freq
keyword: #pfreq=noraman
keyword: PBEPBE/SDD
title: #p freq=noraman PBEPBE/SDD
converged: YES YES NO NO
title: Mulliken charges:
elementType: O O C C C C C C C C C C C C C C H H H H H H H H H H H H H H H H H H H H H H H H
charge: -0.422387 -0.239748 -0.374792 -0.342171 -0.469782 -0.341180 -0.174941 -0.377941 -0.476909 -0.718255 -0.531338 -0.178597 -0.482504 -0.188561 -0.163796 0.202277 0.196002 0.189254 0.177829 0.211659 0.203162 0.199906 0.186088 0.191018 0.219960 0.223311 0.200370 0.205061 0.239502 0.246191 0.200899 0.209755 0.210721 0.205379 0.221866 0.269418 0.251645 0.220887 0.226159 0.374583
chargesum: 0.00000
title: Mulliken charges with hydrogens summed into heavy atoms:
elementType: O O C C C C C C C C C C C C C C
charge: -0.047804 -0.239748 0.010464 0.047317 -0.066714 0.035925 0.045019 0.045740 -0.032346 -0.061409 -0.115239 0.043269 0.038558 0.032327 0.062364 0.202277
polarizability: 1.86500938e+02 -4.15355954e+00 1.54068628e+02 6.15659505e-01 1.49062330e+00 1.35160676e+02
1716.lowfreq: -4.3198 -0.0002 0.0002 0.0003 3.4207 8.4631 19.9312 24.7067 29.8070
frequency: 19.7631 24.4616 29.7752 35.5592 53.3890 60.2698 82.2756 91.6157 109.2520 131.9334 151.4235 164.1065 178.3919 201.9855 242.6906 251.1715 254.3102 296.6312 312.8226 361.4600 387.6737 424.8263 451.1673 465.2315 488.0912 498.6123 508.7921 583.0918 637.0197 726.6760 746.2415 767.1541 787.4918 800.3691 834.6399 841.0299 871.6221 889.4107 917.6370 925.3653 937.1876 969.8323 976.9458 982.6836 998.1486 1008.5251 1030.1157 1044.3087 1061.3694 1068.4431 1086.2408 1099.1795 1102.6335 1110.9806 1135.3621 1167.0482 1176.1337 1193.1195 1202.7313 1214.6789 1246.7043 1252.3651 1263.3377 1267.9166 1273.7228 1285.5788 1287.2866 1288.0299 1295.8478 1307.0228 1330.5959 1334.9614 1344.8104 1352.1892 1356.7830 1367.2909 1395.0352 1430.8195 1449.6197 1460.3202 1460.7720 1462.4917 1467.6283 1469.8531 1480.1964 1481.4746 1494.7482 1668.0375 1679.2292 1687.2110 2938.7710 2952.0429 2955.9459 2960.6432 2967.0216 2969.4527 2970.8915 2988.0513 2995.0551 2997.9121 3008.1249 3019.7427 3028.0832 3037.0100 3039.4366 3046.1097 3055.8633 3060.9042 3062.6992 3064.3885 3072.7333 3074.4332 3080.7803 3511.1156
redmass: 5.2157 4.5475 5.4735 5.1134 4.1389 3.8412 1.6430 2.8400 2.4556 2.2609 2.5121 2.9439 2.3930 2.1203 2.1488 1.3033 2.3471 3.4347 2.4634 2.6701 2.6634 2.3144 2.7953 2.5254 2.1050 2.2163 2.8024 3.7003 1.3735 1.0926 1.7699 1.2752 1.7806 1.5998 2.3907 1.9538 2.1187 1.6589 1.5424 2.1676 1.8974 1.2359 1.5808 1.2921 1.8016 1.8824 2.6184 2.5294 1.8101 2.9147 2.1647 1.9918 1.8844 2.0983 1.8520 1.6724 1.1884 1.4308 1.2786 1.4026 1.5023 1.3619 1.2256 1.2747 1.2396 1.1697 1.2566 1.1204 1.2735 1.3021 1.3993 1.4176 1.4710 1.4228 1.6001 1.7317 1.2109 1.0922 1.0917 1.0863 1.0953 1.0755 1.0750 1.0921 1.0713 1.0561 1.0628 7.9352 6.4593 6.6591 1.0651 1.0599 1.0598 1.0615 1.0593 1.0378 1.0641 1.0610 1.0958 1.0627 1.1008 1.0986 1.0931 1.1034 1.0968 1.0952 1.0974 1.0934 1.0992 1.0970 1.0881 1.1003 1.0889 1.0639
irintensity: 0.1091 0.3521 0.5457 0.2627 0.1221 0.7108 0.1529 0.5245 0.0829 0.4184 0.7408 0.8448 0.8647 0.1413 2.2705 0.9805 1.0843 3.1226 2.3624 1.6415 0.7210 8.6467 12.3467 16.0940 0.6029 21.7615 3.8834 8.6124 122.8043 9.6297 11.3111 0.3785 3.4878 3.9654 9.2629 1.1610 12.3928 4.5341 4.9324 3.3776 0.8609 21.7139 15.6629 63.2310 1.5152 16.8817 240.1254 15.1828 14.0783 12.2227 1.2498 7.4987 2.0092 20.2588 6.3390 0.8177 1.0442 2.0996 0.5841 0.7169 2.8736 3.3257 5.1174 2.8780 1.2668 0.3195 0.2829 0.0861 1.5154 6.6590 6.7326 1.6666 1.8896 7.1728 1.9848 35.9690 9.5307 31.0329 13.6453 13.2398 13.4339 1.2260 0.4825 17.0503 5.9773 10.3446 14.5501 202.8171 2.4648 0.3438 38.2854 17.9482 8.1065 16.4284 132.0501 29.3257 30.2816 38.2074 5.4201 21.7343 8.1366 26.1296 7.7722 90.3074 5.7021 11.5976 13.8063 8.4931 72.8565 44.9139 11.8516 50.4384 89.6294 19.2086
temp: 298.150 k
press: 1.00000 atm
elementType: 8 8 6 6 6 6 6 6 6 6 6 6 6 6 6 6 1 1 1 1 1 1 1 1 1 1 1 1 1 1 1 1 1 1 1 1 1 1 1 1
symmnumber: 1
zpe: 914964.9 jmol-1
zpe.correction: 0.348492 hartree
zpe.thermalcorrener: 0.368190 hartree
zpe.thermalcorrenthalpy: 0.369135 hartree
zpe.thermalcorrgfe: 0.296889 hartree
zpe.sumelectzpe: -697.026781 hartree
zpe.sumelectthermal: -697.007083 hartree
zpe.sumelectthermalent: -697.006138 hartree
zpe.sumelectthermalfe: -697.078384 hartree
dipole: -0.9744 -0.0460 1.0705
dipole: 1.4483
quadrupole: -104.9588 -99.7534 -95.3737
quadrupole: -1.6484 7.2161 -1.7311
quadrupole: -4.9301 0.2752 4.6549 -1.6484 7.2161 -1.7311
hfenergy: -697.375273 hartree
pointgroup: C01 [X(C14H24O2)]
dipole: 0.3904419 -0.0457677 0.4124665 debye
polarizability: 185.2913113|-7.2446139|155.3196243|-2.0727982|-0.0772027|135.1193066 unknown
InChI: InChI=1S/C14H24O2/c1-2-3-4-5-6-7-8-9-10-11-12-13-14(15)16/h6-7,9-10,15H,2-5,8,11-13H2,1H3
charge 0 multiplicity 1
40 atoms
O  -1.503778 -2.531693 -0.65914
O  -3.466453 -1.451959 -1.261154
C  3.825781 -0.253148 0.336413
C  2.775548 -1.261709 -0.179971
C  3.661352 1.176445 -0.253547
C  2.928163 -2.667293 0.446077
C  2.437764 1.905777 0.264058
C  -3.502687 0.060869 1.247499
C  -3.341188 1.364338 0.414158
C  1.930306 -3.694856 -0.131924
C  0.20375 3.126524 0.03513
C  1.417027 2.378628 -0.496951
C  -2.423388 -0.999219 0.951402
C  -2.038571 2.08759 0.690864
C  -1.101297 2.396144 -0.24324
C  -2.562335 -1.636463 -0.417125
H  4.840327 -0.628902 0.090957
H  3.772815 -0.198851 1.444079
H  2.863107 -1.342613 -1.284314
H  1.755925 -0.876321 0.022169
H  4.566375 1.767005 0.00211
H  3.622144 1.116105 -1.35946
H  3.966332 -3.026835 0.289161
H  2.789245 -2.5911 1.544249
H  2.397474 2.056756 1.356009
H  -4.503815 -0.367167 1.052746
H  -3.45778 0.310015 2.326108
H  -4.193707 2.030048 0.661505
H  -3.426462 1.12407 -0.661403
H  0.886878 -3.357723 0.010422
H  2.094814 -3.831314 -1.218352
H  2.041824 -4.683307 0.351764
H  0.162818 4.126709 -0.449892
H  0.312157 3.303817 1.12199
H  1.44692 2.219075 -1.587007
H  -1.410079 -0.558411 1.018238
H  -2.450843 -1.817386 1.697406
H  -1.855781 2.374173 1.74041
H  -1.280146 2.106292 -1.291336
H  -1.619838 -2.940812 -1.559712
