program: Gaussian 09
title: 000151506
version: EM64L-G09RevD.01
frameworkgroup: C1[X(C10H10N2O2S)]
method: RPBEPBE
basis: SDD
operation: Freq
keyword: #p
keyword: freq=noraman
keyword: PBEPBE/SDD
title: #p freq=noraman PBEPBE/SDD
converged: YES YES NO NO
title: Mulliken charges:
elementType: S O O N N C C C C C C C C C C H H H H H H H H H H
charge: 1.033130 -0.532579 -0.532507 -0.619605 -0.076525 0.334015 -0.148784 0.471064 -0.367565 -0.437492 -0.219121 -0.317036 -0.739956 -0.177053 -0.369688 0.345008 0.305454 0.239418 0.234551 0.249308 0.277892 0.273861 0.291589 0.234343 0.248277
chargesum: 0.00000
title: Mulliken charges with hydrogens summed into heavy atoms:
elementType: S O O N N C C C C C C C C C C
charge: 1.033130 -0.532579 -0.532507 -0.274597 -0.076525 0.334015 -0.148784 0.471064 -0.062110 -0.198074 0.015430 -0.067728 0.103386 0.057290 -0.121411
polarizability: 2.25302580e+02 2.50582020e+00 1.79852254e+02 -8.16733160e+00 2.80278742e+00 8.69096948e+01
1716.lowfreq: -3.6468 -0.9753 -0.0015 0.0018 0.0023 7.5865 16.3737 39.1727 90.6786
frequency: 15.6951 39.1005 90.6661 127.2599 160.6347 170.5011 178.8894 193.9226 208.1267 256.5939 278.9307 338.8290 349.2849 408.4890 426.9560 468.3499 486.8169 508.8610 534.8708 557.5575 570.5054 595.7058 648.1067 709.3622 767.3626 793.9286 797.2237 811.7835 830.8044 849.9740 876.5008 905.6109 911.7111 945.4349 962.0697 983.2614 992.7849 1020.2700 1028.4389 1050.7663 1079.2467 1142.5403 1190.6498 1221.6896 1235.8827 1276.2792 1291.3505 1301.3535 1357.7309 1384.2472 1408.0498 1410.3967 1417.0914 1431.1211 1455.1103 1497.9958 1561.2253 1587.3743 1612.2461 3029.6274 3131.5619 3132.6976 3137.4973 3154.5698 3171.0166 3174.4362 3180.8066 3185.5475 3345.0409
redmass: 5.0923 5.0288 5.9767 4.3276 2.3893 1.7018 3.6449 4.1249 8.0349 4.4270 4.6032 8.4187 6.3256 5.4507 4.1608 3.2600 4.9328 6.6418 3.9489 6.3398 4.3308 6.4702 3.4203 5.9855 1.3087 3.0053 2.8457 3.6450 2.1363 2.0446 5.7025 2.1667 1.3845 1.4347 1.3259 1.3452 1.3874 2.5268 2.8026 2.3390 2.3478 1.3210 1.2129 1.8343 1.8449 2.1533 1.2179 1.5923 3.4613 2.0192 1.0583 2.3393 1.0580 3.2527 2.7578 3.7183 6.5329 5.7076 6.5728 1.0239 1.0879 1.0873 1.0921 1.0945 1.0991 1.0966 1.1076 1.1082 1.0748
irintensity: 3.7942 4.7249 1.6930 2.3266 0.4618 0.4602 5.7810 2.4331 2.5067 6.4220 8.3959 27.0556 20.3981 55.4271 1.1245 1.9457 7.8489 5.5419 5.3856 63.3246 21.1603 3.0200 3.3489 30.8089 21.8679 3.6850 23.4476 17.0344 223.5060 51.5439 7.3541 19.4132 0.3677 0.2964 167.2578 1.0965 2.5931 42.7935 18.9544 12.1463 25.3062 1.0808 0.4501 2.0913 4.5095 4.5277 4.4947 56.0565 6.0956 59.9177 9.2065 11.2083 13.5753 3.0816 50.7349 41.9588 24.7349 3.7698 8.3528 0.4220 4.7513 2.9576 15.2351 22.8272 27.6748 3.3431 0.1499 0.3611 88.5104
temp: 298.150 k
press: 1.00000 atm
elementType: 16 8 8 7 7 6 6 6 6 6 6 6 6 6 6 1 1 1 1 1 1 1 1 1 1
symmnumber: 1
zpe: 480637.6 jmol-1
zpe.correction: 0.183065 hartree
zpe.thermalcorrener: 0.197041 hartree
zpe.thermalcorrenthalpy: 0.197986 hartree
zpe.thermalcorrgfe: 0.140901 hartree
zpe.sumelectzpe: -1043.829740 hartree
zpe.sumelectthermal: -1043.815763 hartree
zpe.sumelectthermalent: -1043.814819 hartree
zpe.sumelectthermalfe: -1043.871904 hartree
dipole: -6.2904 -0.0408 4.3276
dipole: 7.6354
quadrupole: -98.3612 -90.7780 -95.8146
quadrupole: 0.9546 8.9559 -2.0195
quadrupole: -3.3766 4.2066 -0.8300 0.9546 8.9559 -2.0195
hfenergy: -1044.0128048 hartree
pointgroup: C01 [X(C10H10N2O2S1)]
dipole: 2.4661584 0.2627318 1.6949991 debye
dipolederiv: 2.3516014 -0.2544656 0.0049887 0.1146146 1.1408304 0.0570867 -0.1502685 0.0881571 1.4196981 -0.757914 0.0743324 -0.0449402 0.2691604 -0.5822655 0.0808184 -0.1218388 0.029378 -0.5723013 -0.6731346 -0.0254804 -0.0384033 -0.1496972 -0.5965217 -0.0439028 0.0795576 -0.0051919 -0.5220831 -1.2914652 0.2808948 -0.15835 -0.0599674 -0.329118 0.0858482 -0.5797688 0.2325573 -0.5804698 -0.4636828 -0.0484863 -0.0051426 0.0029865 -0.3096065 0.0472724 -0.0920483 0.0156654 -0.2283442 0.6629847 -0.2904013 0.2332636 -0.6678258 0.2228149 -0.07978 0.62434 -0.1768545 0.1103573 -0.0052243 0.3821691 -0.1036155 0.0191412 0.0067444 -0.0341111 0.1445788 0.0159918 0.0158184 -0.2449347 -0.1025194 -0.0292563 0.2552632 0.1131495 0.0251288 -0.1803373 -0.0291179 0.0973584 -0.004194 0.0026841 0.0605713 0.2631785 -0.2090621 0.0402661 -0.1575882 0.0689987 -0.1875696 -0.1482445 -0.0801292 0.0630968 -0.0863082 -0.1112608 -0.0700562 0.0246335 -0.0494647 -0.173957 0.1081548 0.0133438 0.0600052 -0.120073 0.2013888 -0.0974391 0.0821183 -0.0975382 -0.0716122 0.1952876 0.0149223 0.0613461 -0.054572 0.1363163 -0.0945592 0.0900819 -0.0596387 -0.0949392 -0.3597136 0.0840026 -0.0350304 -0.007705 -0.1166464 -0.0471332 0.1644023 -0.1011541 -0.2582352 0.0348224 0.1453588 -0.0069082 0.041047 -0.2456125 0.0544343 0.0103561 0.0552584 -0.1362 0.136597 -0.1217981 0.0831793 0.0178856 0.3426569 -0.1199986 0.0449926 -0.1445111 -0.0122951 0.2026198 0.0267611 0.0498211 0.2101701 0.1479504 -0.0391696 0.1157315 -0.0517015 0.2937125 0.0397388 -0.0551548 -0.0289003 -0.0297761 0.1214265 0.0197118 -0.0126681 0.0152522 0.1467778 -0.0384479 0.0977267 -0.0691134 0.0334655 0.036037 0.048107 -0.0487675 0.0653553 0.1346726 0.0857171 -0.0358981 -0.0017299 -0.0066635 -0.094288 0.0632108 -0.0028732 0.0676663 0.1334661 -0.0226469 0.0402456 -0.043356 0.1021222 0.042938 0.0496912 -0.0644001 0.0411057 0.1203176 0.0589534 0.0453461 -0.0537641 0.0466678 0.0244608 -0.0005201 -0.0727429 0.0029447 0.0308006 0.0882471 -0.0607801 -0.006406 -0.0643508 0.0041854 0.0053393 -0.0246541 -0.0013898 0.029899 0.0491133 -0.018935 0.0288421 0.0254684 0.0963478 -0.0249171 0.142964 -0.0560684 0.0350894 -0.0717452 -0.0953814 -0.0144957 -0.0971395 0.0552982 0.0148136 -0.0187743 0.0130922 0.1579629 0.0675103 -0.0183575 -0.0057022 -0.0570924 -0.0981638 0.0598584 0.0029737 0.0612076 0.1120761 unknown
polarizability: 225.3613566|2.3675606|174.6646743|8.3235238|-21.2921764|92.0384976 unknown
InChI: InChI=1S/C10H10N2O2S/c1-15(13,14)12-9-6-2-4-8-5-3-7-11-10(8)9/h2-7,12H,1H3
charge 0 multiplicity 1
25 atoms
S  -3.025519 0.499678 -0.192205
O  -3.820716 1.643245 -1.016585
O  -3.584989 -1.013783 -0.042339
N  -1.352254 0.399798 -1.013732
N  1.075451 1.571175 -0.69709
C  -0.326183 -0.386368 -0.454598
C  0.975091 0.239001 -0.328656
C  2.097252 -0.533692 0.149632
C  -0.489945 -1.731589 -0.076009
C  1.895558 -1.897121 0.536598
C  0.621951 -2.467979 0.430751
C  3.364156 0.135101 0.212332
C  -2.68945 1.152381 1.588921
C  3.460366 1.475685 -0.169587
C  2.283936 2.160291 -0.613361
H  -1.033299 1.355244 -1.26799
H  -1.469865 -2.205212 -0.185348
H  2.74395 -2.483941 0.906341
H  0.467871 -3.512657 0.721737
H  4.246022 -0.415562 0.559657
H  -1.972664 0.45503 2.043906
H  -2.287819 2.167895 1.470931
H  -3.666288 1.138259 2.091769
H  4.414077 2.010628 -0.133433
H  2.33421 3.215293 -0.905843
