program: Gaussian 09
title: 000151502
version: EM64L-G09RevD.01
frameworkgroup: C1[X(C23H26N2O4S)]
method: RPBEPBE
basis: SDD
operation: Freq
keyword: #p
keyword: freq=noraman
keyword: PBEPBE/SDD
title: #p freq=noraman PBEPBE/SDD
converged: YES YES NO NO
title: Mulliken charges:
elementType: S O O O O N N C C C C C C C C C C C C C C C C C C C C C C C H H H H H H H H H H H H H H H H H H H H H H H H H H
charge: 0.976820 -0.300908 -0.537007 -0.525868 -0.204060 -0.517203 -0.571087 -0.214984 -0.407901 -0.341661 -0.360877 0.183896 -0.400914 -0.085073 0.299219 -0.217586 -0.246827 0.111203 0.431689 0.451736 -0.343134 -0.381793 -0.350521 -0.361605 -0.455135 -0.230013 -0.422117 -0.800509 -0.240506 -0.238774 0.297077 0.216479 0.224544 0.190049 0.238867 0.215463 0.184666 0.311386 0.187153 0.208365 0.283823 0.282972 0.273549 0.258258 0.248541 0.243746 0.285105 0.261461 0.242140 0.232462 0.241511 0.227838 0.233284 0.245071 0.235682 0.232009
chargesum: 0.00000
title: Mulliken charges with hydrogens summed into heavy atoms:
elementType: S O O O O N N C C C C C C C C C C C C C C C C C C C C C C C
charge: 0.976820 -0.300908 -0.537007 -0.525868 -0.204060 -0.205817 -0.039279 0.082093 0.033123 0.087254 0.039252 0.183896 -0.005396 -0.085073 0.299219 0.066236 0.036145 0.111203 0.431689 0.451736 -0.094594 -0.138048 -0.065416 -0.100145 -0.212995 0.002450 -0.180606 -0.094316 -0.004824 -0.006766
polarizability: 3.75295291e+02 -2.48734547e+01 2.56126794e+02 2.51812897e+00 -2.49381101e+01 2.83562172e+02
1716.lowfreq: -27.2204 -3.3814 -2.4924 0.0006 0.0007 0.0016 4.7671 9.4341 10.2366
frequency: -27.1925 8.6092 10.0882 15.5610 21.7437 28.4489 45.2175 48.9865 55.0255 58.1330 79.4307 88.1897 109.3520 119.3915 125.2274 135.9991 140.7440 157.6755 172.7473 176.1940 182.1500 219.7566 232.7282 234.2810 254.7030 269.2422 279.5628 283.5590 310.5723 313.3359 354.2197 372.9538 385.0331 406.9749 415.6755 422.0107 426.0619 435.4384 459.3088 467.5379 490.8163 506.3058 509.1514 522.5101 567.3648 581.3829 596.9889 617.2368 621.3163 632.6715 676.6733 690.6717 705.6175 721.1371 746.8015 748.1323 763.9068 777.2059 782.9618 786.6292 790.3337 813.2633 817.2927 824.4769 844.3796 847.1013 881.1569 888.4016 900.1312 910.5660 944.6068 959.1251 959.8300 968.0947 980.3366 983.3686 987.9614 993.9644 999.1247 999.5710 1016.6794 1029.9701 1030.9272 1048.9414 1049.6468 1050.2637 1071.5836 1075.5839 1091.4487 1100.1939 1116.3905 1118.1019 1144.3151 1147.2191 1172.9686 1178.5972 1183.7548 1212.3930 1217.7701 1218.3201 1227.2322 1237.3454 1252.6258 1264.0683 1278.2868 1285.3703 1288.0558 1295.4658 1302.0395 1325.8286 1354.7255 1372.7772 1377.3576 1381.1407 1388.9916 1390.9216 1399.4920 1403.5847 1422.0495 1441.4401 1452.3084 1456.1073 1466.3330 1469.4631 1470.0095 1474.4856 1479.9443 1493.3034 1513.1583 1579.3011 1593.4456 1593.9080 1597.7934 1630.7848 1639.6081 1641.1377 2871.8711 2958.1033 2975.1589 2982.0859 2982.1656 3008.2272 3024.2813 3030.3485 3041.3284 3062.5692 3063.4789 3092.7147 3125.2904 3131.8258 3134.5577 3137.6098 3139.0468 3156.9396 3158.0551 3159.6414 3163.0903 3172.9391 3204.8394 3380.4137 3449.2123 3576.2157
redmass: 1.0235 5.4257 5.4874 5.6778 5.2561 5.0576 5.2204 4.7671 3.9049 2.1808 3.4729 6.2017 5.6277 3.4283 4.4605 3.1381 2.9037 3.7461 4.9212 4.1397 4.4598 6.1147 5.2344 1.3646 5.4717 4.3529 4.8653 4.9883 3.6629 4.2239 4.2232 3.9833 4.3754 2.8781 3.7853 4.6841 4.7487 4.6909 4.9727 3.2691 4.3691 3.2747 6.4274 4.3207 3.4845 6.0689 5.4820 1.2847 6.9604 3.3844 5.1723 5.5197 3.3547 5.5310 1.1322 1.3383 3.1414 4.1949 2.5566 2.7120 1.2919 2.1091 2.7576 1.5941 1.2522 4.2486 1.5921 1.6791 2.8720 1.5205 2.9298 4.6991 1.3237 1.3542 1.3979 1.3745 1.8650 2.9637 1.7347 1.6308 3.2221 2.8367 2.4198 2.4959 1.6239 3.4831 2.5226 2.4617 2.7562 3.6398 1.9108 1.3632 1.5881 1.6015 1.0820 1.3025 1.1534 1.3559 2.0738 2.5431 1.3222 1.9396 1.3761 1.6679 1.2474 1.0891 1.2451 1.2667 1.1262 1.3019 1.5036 1.4034 1.8707 4.8878 1.4447 2.9941 1.2720 3.8106 4.2359 2.8264 2.4629 1.0813 1.0704 1.0747 2.3305 1.0913 1.0906 1.0901 3.8285 7.5527 6.7435 6.1460 5.5562 8.9990 1.0964 7.9994 1.0714 1.0636 1.0611 1.0472 1.0515 1.0867 1.0930 1.0933 1.0950 1.1030 1.0960 1.0997 1.0866 1.0875 1.0894 1.0888 1.0898 1.0957 1.0960 1.0956 1.0964 1.0983 1.0945 1.0749 1.0449 1.0973
irintensity: 0.5152 0.2870 1.1929 0.4019 1.8313 0.3868 0.4495 0.5213 1.3994 2.2864 0.7167 1.5955 3.4542 0.1685 0.4307 2.5433 0.4629 1.0192 2.0315 4.4467 3.7915 5.3308 0.7245 54.7042 2.7979 14.2604 5.8868 1.7741 32.2801 19.0154 4.0209 7.0242 6.6793 0.0396 8.8697 2.5167 6.9453 0.5140 121.2361 0.0765 24.9508 92.8066 3.7857 13.5047 12.0157 31.3703 1.0149 208.4523 0.1450 0.0909 9.6492 11.6020 0.4594 6.6390 17.5437 2.1053 19.9137 10.3680 37.0110 40.1007 1.6328 138.5603 82.9696 16.0970 0.2333 66.9904 7.3441 16.4015 43.7914 0.8408 4.6594 37.1812 2.9564 0.5289 0.2462 3.9176 2.2103 5.0001 1.7595 2.3487 24.0231 8.4106 5.5291 27.1876 11.2697 14.3864 46.2042 2.7561 33.5344 484.8828 10.8331 19.6158 25.5185 23.8235 0.8739 26.0183 14.5072 21.9287 20.0568 23.2887 9.3457 10.6949 58.6109 4.1806 3.3086 3.8961 8.1944 2.7358 6.5021 9.3325 3.8731 15.6142 19.4897 1.2277 20.8120 10.5257 15.6554 13.5244 5.0864 3.1757 11.0601 2.2295 0.9487 15.0877 19.7115 14.8641 6.7575 6.1939 15.5055 21.4353 1.4005 6.9980 10.6269 110.1397 40.5902 47.3392 100.0063 17.0609 3.5162 25.9659 42.5922 20.0804 16.9012 14.8525 0.8460 76.3910 17.5608 15.7072 1.2500 2.1800 8.2555 8.7416 10.7276 23.6465 32.0095 2.7980 7.6693 14.3952 0.0765 24.1950 2.0868 0.2134
temp: 298.150 k
press: 1.00000 atm
elementType: 16 8 8 8 8 7 7 6 6 6 6 6 6 6 6 6 6 6 6 6 6 6 6 6 6 6 6 6 6 6 1 1 1 1 1 1 1 1 1 1 1 1 1 1 1 1 1 1 1 1 1 1 1 1 1 1
symmnumber: 1
zpe: 1162515.5 jmol-1
zpe.correction: 0.442779 hartree
zpe.thermalcorrener: 0.472640 hartree
zpe.thermalcorrenthalpy: 0.473584 hartree
zpe.thermalcorrgfe: 0.376401 hartree
zpe.sumelectzpe: -1698.142439 hartree
zpe.sumelectthermal: -1698.112578 hartree
zpe.sumelectthermalent: -1698.111633 hartree
zpe.sumelectthermalfe: -1698.208817 hartree
dipole: 5.4946 -2.5764 -2.1721
dipole: 6.4457
quadrupole: -154.5277 -199.5826 -180.4225
quadrupole: 9.2466 5.4179 -11.8163
quadrupole: 23.6499 -21.4050 -2.2449 9.2466 5.4179 -11.8163
hfenergy: -1698.5852175 hartree
pointgroup: C01 [X(C23H26N2O4S1)]
dipole: 2.3201986 -0.8904281 -0.5046797 debye
polarizability: 379.3689343|-1.6952392|239.8484338|11.0467039|-9.2993139|295.7668882 unknown
InChI: InChI=1S/C23H26N2O4S/c1-17-12-14-19(15-13-17)30(27,28)25-21(10-4-5-16-24)23(26)29-22-11-6-8-18-7-2-3-9-20(18)22/h2-3,6-9,11-15,21,25H,4-5,10,16,24H2,1H3
charge 0 multiplicity 1
56 atoms
S  -2.259626 2.622943 -0.096566
O  0.165017 -1.022048 0.161595
O  -2.363144 2.419308 1.513854
O  -3.15884 3.678852 -0.936687
O  -0.448102 -0.324468 -2.008033
N  -2.741359 0.954684 -0.784515
N  -7.369647 -3.565647 1.076313
C  -2.068792 -0.192064 -0.146715
C  -2.989219 -1.447887 -0.251285
C  -4.271428 -1.302986 0.593233
C  -5.219884 -2.508547 0.416683
C  -0.711745 -0.495493 -0.79906
C  -6.489142 -2.396759 1.286073
C  -0.437184 2.951715 -0.497598
C  1.506807 -1.442544 -0.108034
C  0.531065 2.536432 0.431486
C  -0.126983 3.601996 -1.701785
C  2.37831 -1.365554 1.032672
C  3.744752 -1.81874 0.869948
C  2.258999 3.402642 -1.101461
C  1.88646 2.765756 0.113102
C  1.237278 3.825767 -1.992306
C  1.93413 -1.93303 -1.34224
C  1.950934 -0.8638 2.305687
C  4.1736 -2.322516 -0.402804
C  3.286775 -2.376508 -1.478592
C  4.632863 -1.747892 1.994321
C  3.72301 3.614372 -1.438544
C  2.843363 -0.807465 3.379237
C  4.194876 -1.252024 3.223956
H  -1.926423 0.046977 0.923069
H  -3.246613 -1.615671 -1.315825
H  -2.409374 -2.328897 0.08957
H  -3.994067 -1.203013 1.662777
H  -4.784332 -0.365049 0.309129
H  -4.706486 -3.455145 0.675316
H  -5.516738 -2.589226 -0.651115
H  -2.622614 0.988574 -1.814734
H  -6.980633 -1.414422 1.076256
H  -6.192556 -2.38135 2.352754
H  0.234215 2.075943 1.379131
H  -0.921744 3.942361 -2.373568
H  -8.133988 -3.64624 1.754235
H  -7.708861 -3.654733 0.112383
H  2.662109 2.44377 0.817661
H  1.509638 4.335603 -2.923281
H  1.255578 -1.967616 -2.19524
H  0.913476 -0.538481 2.423481
H  5.208105 -2.665656 -0.517222
H  3.617531 -2.762261 -2.448465
H  5.666212 -2.09294 1.870793
H  3.852035 4.340832 -2.258532
H  4.290123 3.979188 -0.563594
H  4.192344 2.663897 -1.7571
H  2.507871 -0.425211 4.349379
H  4.88195 -1.20433 4.075706
