program: Gaussian 09
title: 000151500
version: EM64L-G09RevD.01
frameworkgroup: C1[X(C7H16O3S)]
method: RPBEPBE
basis: SDD
operation: Freq
keyword: #p
keyword: freq=noraman
keyword: PBEPBE/SDD
title: #p freq=noraman PBEPBE/SDD
converged: YES YES NO NO
title: Mulliken charges:
elementType: S O O O C C C C C C C H H H H H H H H H H H H H H H H
charge: 1.028840 -0.402001 -0.519809 -0.531149 -0.363532 -0.323272 -0.350001 -0.609692 -0.355266 -0.691990 -0.489188 0.199592 0.200342 0.229172 0.240903 0.197343 0.195331 0.286112 0.290804 0.197396 0.196491 0.212274 0.218787 0.211742 0.250510 0.236893 0.243369
chargesum: 0.00000
title: Mulliken charges with hydrogens summed into heavy atoms:
elementType: S O O O C C C C C C C
charge: 1.028840 -0.402001 -0.519809 -0.531149 0.036402 0.146803 0.042672 -0.032776 0.038622 -0.049187 0.241583
polarizability: 1.59404825e+02 -5.64393748e+00 9.97011430e+01 -1.34454772e+00 8.46374331e-01 9.54604877e+01
1716.lowfreq: -1.9930 -0.0018 0.0006 0.0016 9.3415 11.5429 29.7568 46.7663 57.6309
frequency: 28.9249 46.6000 56.9924 58.1873 72.6987 119.4417 122.1434 128.1174 139.7475 164.2004 212.0250 219.2802 227.0050 254.5128 283.0207 342.3262 385.2846 404.6679 453.7323 525.2337 608.7278 730.1248 752.5149 789.3267 841.5530 871.5483 890.3040 930.9825 937.9045 988.5367 1001.4203 1031.9877 1060.0615 1076.4519 1089.2337 1107.3651 1114.9794 1119.9001 1190.9792 1225.5113 1238.6116 1265.7182 1282.2122 1292.2371 1303.7486 1317.4849 1347.5007 1354.0926 1391.9453 1411.3309 1414.8274 1443.3806 1466.7491 1468.7303 1476.4044 1476.8126 1477.3331 1484.6122 1491.0259 2962.0953 2966.4072 2971.6440 2974.6479 2975.6378 2998.5176 3000.4145 3016.2801 3039.3392 3052.2177 3064.4949 3072.6994 3075.4182 3077.3330 3098.8685 3143.4364
redmass: 3.9315 3.3522 1.9849 3.6140 2.6167 2.1651 2.3729 1.1800 2.1499 5.6414 3.7301 3.9418 1.1778 3.8086 7.0319 8.9662 4.1564 3.2932 4.5999 10.1433 5.9340 1.0687 1.0917 1.1953 14.4239 1.3308 1.8968 9.2279 3.0060 1.3822 4.1417 3.4710 2.9252 2.3824 1.2640 1.3930 1.7268 1.5476 1.6804 1.2239 1.3424 1.2611 1.1528 1.0669 1.0954 1.3255 1.3999 1.5899 1.2135 1.1171 1.1043 1.0492 1.0667 1.0735 1.0646 1.0570 1.0423 1.0822 1.0956 1.0586 1.0590 1.0283 1.0594 1.0361 1.0601 1.0972 1.1020 1.1045 1.0560 1.1046 1.1009 1.0993 1.1050 1.1031 1.1103
irintensity: 0.1378 4.0727 2.7146 2.6043 0.3119 0.6822 0.9589 0.7592 0.1272 14.8130 4.4288 4.6703 0.1450 1.2615 9.8199 16.8249 21.2082 7.5921 22.1793 108.8187 2.3264 11.6274 1.1224 1.7459 61.7830 8.6148 3.7142 75.2904 57.4315 23.7604 3.4501 4.5844 7.1040 0.7594 12.3074 19.8758 13.6078 1.5597 1.2073 4.1948 0.4621 10.0061 0.2023 0.7141 0.3162 11.1570 6.4351 0.2632 11.0416 4.7649 6.4357 15.4458 1.1694 0.0741 8.3370 18.6454 12.9732 0.7488 27.6087 0.1640 0.8744 46.6078 85.8421 41.6967 18.1112 1.4850 0.0100 38.9592 5.1553 19.3822 98.4187 50.2030 25.3418 13.9120 1.7448
temp: 298.150 k
press: 1.00000 atm
elementType: 16 8 8 8 6 6 6 6 6 6 6 1 1 1 1 1 1 1 1 1 1 1 1 1 1 1 1
symmnumber: 1
zpe: 589147.5 jmol-1
zpe.correction: 0.224394 hartree
zpe.thermalcorrener: 0.239868 hartree
zpe.thermalcorrenthalpy: 0.240812 hartree
zpe.thermalcorrgfe: 0.179783 hartree
zpe.sumelectzpe: -898.971652 hartree
zpe.sumelectthermal: -898.956179 hartree
zpe.sumelectthermalent: -898.955234 hartree
zpe.sumelectthermalfe: -899.016264 hartree
dipole: 2.3617 3.2201 0.3137
dipole: 4.0056
quadrupole: -67.0690 -81.4062 -82.1061
quadrupole: -7.1672 -0.1126 0.2981
quadrupole: 9.7914 -4.5457 -5.2457 -7.1672 -0.1126 0.2981
hfenergy: -899.1960467 hartree
pointgroup: C01 [X(C7H16O3S1)]
dipole: -0.9181453 -1.2556816 0.252652 debye
polarizability: 159.5080815|-5.0955851|99.4307301|1.2393457|-1.1685198|95.6276443 unknown
InChI: InChI=1S/C7H16O3S/c1-3-4-5-6-7-11(8,9)10-2/h3-7H2,1-2H3
charge 0 multiplicity 1
27 atoms
S  2.264691 0.459928 -0.106565
O  3.404162 -1.020341 -0.3435
O  2.186335 1.350174 -1.456705
O  2.653631 1.177899 1.29694
C  -1.856958 -0.598977 0.043914
C  -0.569867 0.263248 -0.034105
C  -3.136133 0.267025 -0.028255
C  0.674042 -0.617218 0.070986
C  -4.434643 -0.569245 0.036252
C  -5.707848 0.302005 -0.026118
C  4.813534 -0.703933 -0.041766
H  -1.862125 -1.182336 0.987314
H  -1.863156 -1.334794 -0.785972
H  -0.576522 1.009847 0.783099
H  -0.554258 0.819608 -0.990429
H  -3.127383 0.859759 -0.966023
H  -3.1312 0.999524 0.805012
H  0.817926 -1.100116 1.05019
H  0.781932 -1.34367 -0.75043
H  -4.442332 -1.297973 -0.799681
H  -4.438651 -1.166192 0.97102
H  -5.744306 0.88471 -0.965732
H  -6.622799 -0.316049 0.02374
H  -5.738624 1.019952 0.81493
H  4.901604 -0.155814 0.915175
H  5.279997 -0.12816 -0.860972
H  5.29815 -1.690661 0.05088
