program: Gaussian 09
title: 000151499
version: EM64L-G09RevD.01
frameworkgroup: C1[X(C11H12N2O)]
method: RPBEPBE
basis: SDD
operation: Freq
keyword: #p
keyword: freq=noraman
keyword: PBEPBE/SDD
title: #p freq=noraman PBEPBE/SDD
converged: YES YES NO NO
title: Mulliken charges:
elementType: O N N C C C C C C C C C C C H H H H H H H H H H H H
charge: -0.276099 -0.139436 -0.066753 -0.027403 0.208410 -0.338521 -0.167723 0.109935 -0.274153 -0.322494 0.174765 -0.668907 -0.318447 -0.780455 0.208651 0.258256 0.236178 0.285698 0.249340 0.251785 0.221579 0.220813 0.240401 0.233187 0.247669 0.233724
chargesum: 0.00000
title: Mulliken charges with hydrogens summed into heavy atoms:
elementType: O N N C C C C C C C C C C C
charge: -0.276099 -0.139436 -0.066753 -0.027403 0.208410 0.128386 0.068455 0.109935 0.011546 -0.073154 0.174765 0.025269 -0.078046 -0.065874
polarizability: 1.80980858e+02 -1.93503410e+00 1.62479810e+02 -1.00801179e+00 -7.70444865e+00 6.96584046e+01
1716.lowfreq: -15.4868 -7.9934 -0.0004 0.0005 0.0005 4.7993 17.0001 42.3413 75.0666
frequency: 12.7059 41.7906 75.0489 95.0943 138.3677 196.4150 222.0930 234.2914 272.3394 321.0893 354.2649 377.4426 420.4628 461.6309 465.2850 507.7405 531.5158 573.1066 620.1029 684.4081 688.1681 690.7622 744.5124 780.2742 791.4966 824.7380 859.0135 899.2470 949.9895 951.6441 991.4007 1004.8761 1027.6234 1039.6818 1045.6426 1086.3646 1130.0533 1135.4254 1164.6248 1232.0266 1256.1441 1265.3686 1285.3890 1335.9174 1349.2209 1355.4380 1385.8836 1389.4919 1395.4857 1427.1147 1450.4984 1460.8569 1466.2245 1466.6957 1479.0715 1484.3585 1531.6748 1552.9588 1593.8548 1625.9708 2985.5594 2990.6295 3024.3951 3063.2062 3081.8518 3096.2875 3111.9035 3118.8056 3145.0540 3154.2579 3164.9714 3187.1044
redmass: 1.0248 2.5598 3.7849 4.7728 4.1926 1.4601 2.8947 2.4078 4.4129 3.9388 2.8309 3.6409 4.0457 4.6490 5.6093 4.1139 4.0421 4.3432 3.9170 6.2186 3.3204 5.1993 4.4931 1.2584 3.3400 1.5622 1.6390 3.5555 1.5344 1.7875 1.8493 1.3450 2.4393 3.5370 1.5901 2.0803 1.8917 1.4780 1.5073 2.1705 1.5082 3.1148 2.3668 2.0756 6.3356 1.4658 1.2141 1.3138 1.8332 3.4375 1.5527 1.1548 1.0592 1.0472 1.8314 1.1229 6.0085 6.4133 7.0988 6.8247 1.0382 1.0357 1.0634 1.0970 1.1003 1.0978 1.1031 1.0984 1.0883 1.0891 1.0980 1.0971
irintensity: 0.6331 0.0121 0.0956 2.7103 8.5021 2.2902 1.6620 2.3874 2.3982 3.1925 3.5987 4.2613 3.5509 8.4595 6.0138 0.9707 0.6299 2.4789 6.3167 2.8843 0.0393 8.4903 0.6226 8.6430 1.0335 87.2769 6.1458 3.0995 0.5506 1.1457 6.2186 0.7233 4.5841 1.8210 8.5083 8.4092 14.0191 33.3473 4.4911 30.0614 45.1303 1.1790 39.3637 19.3096 13.7342 3.5061 20.2610 29.9308 4.8847 269.8211 23.0751 7.4639 18.3303 17.2082 32.3834 5.9563 30.1575 82.6652 123.2584 310.1306 16.9271 24.2376 38.2153 16.2358 18.1418 27.0893 16.8851 10.4742 1.7191 5.7213 12.4173 7.4745
temp: 298.150 k
press: 1.00000 atm
elementType: 8 7 7 6 6 6 6 6 6 6 6 6 6 6 1 1 1 1 1 1 1 1 1 1 1 1
symmnumber: 1
zpe: 546241.2 jmol-1
zpe.correction: 0.208052 hartree
zpe.thermalcorrener: 0.220835 hartree
zpe.thermalcorrenthalpy: 0.221779 hartree
zpe.thermalcorrgfe: 0.166997 hartree
zpe.sumelectzpe: -610.108907 hartree
zpe.sumelectthermal: -610.096125 hartree
zpe.sumelectthermalent: -610.095181 hartree
zpe.sumelectthermalfe: -610.149962 hartree
dipole: -2.5850 4.7766 -0.4506
dipole: 5.4499
quadrupole: -76.2025 -84.4425 -84.3762
quadrupole: 16.9703 -2.1340 -0.3074
quadrupole: 5.4712 -2.7688 -2.7025 16.9703 -2.1340 -0.3074
hfenergy: -610.3169596 hartree
pointgroup: C01 [X(C11H12N2O1)]
dipole: 0.8217563 1.9740116 0.1593479 debye
dipolederiv: -0.5519916 -0.1552826 -0.0125383 -0.3918063 -1.2306985 -0.0797413 -0.0472638 -0.1104362 -0.3791625 -1.0880084 -0.3099479 0.013332 0.2151215 -0.8491599 0.0027421 0.0662767 -0.0941337 -0.2072198 -0.8485132 0.2449597 0.0127338 0.0560817 -0.3845335 -0.0157678 0.0211254 -0.0056875 -0.2238269 0.8102194 -0.3980434 -0.0268742 -0.6445442 0.4296925 0.0281702 -0.0953256 0.0329396 0.1401255 -0.5645599 -0.317446 -0.0238478 0.2642827 -0.3406258 -0.0312348 0.0460276 -0.0333566 -0.0154755 0.1298961 0.0912893 -0.0431713 -0.0068019 0.7771459 -0.0350009 -0.0553079 0.0493411 0.2441251 0.7049291 0.5895315 0.0169105 0.3755782 0.583997 0.0575524 0.0347349 0.0833122 -0.049819 0.7529555 0.0059607 -0.0087772 0.3873583 1.3575625 0.1243707 0.0344174 0.1580856 0.1716228 0.3860068 0.1427961 0.011046 -0.1463023 0.1143507 0.0276334 -0.0324496 0.0214334 -0.063661 -0.0324504 0.3230379 0.0333091 -0.1424226 -0.7555721 -0.0347727 -0.0267882 -0.0723635 -0.234558 0.820864 0.000736 -0.0002894 0.3581783 0.4932762 0.0518729 0.0254451 0.0563271 0.0346323 0.0640198 -0.001611 0.0307432 0.0137285 -0.0854345 0.0352956 0.0425645 0.0440123 -0.0736408 -0.3839929 -0.2435137 -0.0341464 -0.4263359 -0.2996728 -0.0016523 -0.0539328 -0.0157233 -0.1744471 -0.3361934 -0.1015266 -0.0086237 -0.0507176 0.0263511 -0.0012495 0.00178 0.0023887 0.0461745 -0.0556914 0.104226 0.1450641 0.0254484 -0.0267695 -0.0089223 0.0791666 -0.0166658 -0.0020809 0.0332789 -0.105078 -0.0986217 -0.017602 0.0580078 0.0350816 -0.0645229 0.0228397 0.0196994 0.0288378 0.0722789 0.0070369 0.1175987 -0.0086855 -0.028788 0.0172271 -0.0272322 0.1444632 0.1248504 -0.0581132 -0.0066995 0.0198187 0.0124083 -0.0166894 0.0044427 -0.0154104 0.139886 -0.0596065 -0.0080299 0.0060844 -0.0341554 0.0733086 -0.0101682 0.0053047 -0.0158132 0.1723162 -0.0198541 0.0421868 0.0964482 0.0675467 0.09595 -0.0564526 0.0632742 -0.0480433 0.026239 -0.0794379 -0.0062994 -0.1213638 -0.0547157 0.1000902 -0.0126844 -0.0702293 0.0094993 0.0034227 0.103884 -0.0522839 -0.008361 -0.0269249 -0.2110819 -0.0124309 -0.0100818 -0.0049407 0.0772714 -0.0504095 0.0936558 0.0167391 0.0949455 0.0345027 -0.0172091 0.0200789 -0.0185045 0.1605584 0.0078509 -0.0132138 0.0701394 -0.017614 0.0805241 -0.0620963 0.1198678 -0.0298995 -0.0533839 0.1043147 0.0507179 0.0085456 -0.0550004 -0.0943535 -0.0267303 -0.0048273 -0.028121 0.1095927 -0.0011983 0.0090126 -0.074818 0.0192561 0.0494198 0.0888717 -0.1210044 0.0561522 -0.0128538 unknown
polarizability: 180.3999774|3.7452673|163.1855633|-1.8739297|6.7313372|69.5335327 unknown
InChI: InChI=1S/C11H12N2O/c1-3-13-7-6-10(14)9-5-4-8(2)12-11(9)13/h4-7H,3H2,1-2H3
charge 0 multiplicity 1
26 atoms
O  -1.863081 -2.882712 -0.220207
N  -0.983331 1.188235 0.302944
N  1.34524 0.78891 0.182656
C  0.076207 0.274475 0.150324
C  -0.210857 -1.115258 -0.024634
C  -0.707371 2.645737 0.432564
C  -2.29161 0.723103 0.265294
C  -1.606023 -1.638151 -0.061692
C  0.901115 -1.984488 -0.166366
C  -2.627259 -0.606234 0.098297
C  2.395566 -0.065403 0.047674
C  -0.577259 3.340004 -0.937352
C  2.204364 -1.469457 -0.131397
C  3.783773 0.536029 0.094687
H  -1.530492 3.086593 1.022985
H  0.232265 2.754332 0.996085
H  -3.058188 1.494733 0.38472
H  0.692517 -3.051291 -0.301172
H  -3.678649 -0.904393 0.086954
H  0.271408 2.91644 -1.499869
H  -1.495571 3.222072 -1.539657
H  -0.393117 4.420452 -0.795895
H  3.075109 -2.123419 -0.239106
H  4.336824 0.33401 -0.84157
H  3.717875 1.625005 0.239534
H  4.376548 0.102075 0.9214
