program: Gaussian 09
title: 000151497
version: EM64L-G09RevD.01
frameworkgroup: C1[X(C3H6N2O)]
method: RPBEPBE
basis: SDD
operation: Freq
keyword: #pfreq=noraman
keyword: PBEPBE/SDD
title: #p freq=noraman PBEPBE/SDD
converged: NO NO NO NO
title: Mulliken charges:
elementType: O N N C C C H H H H H H
charge: -0.251795 -0.252076 -0.358632 -0.400990 -0.503029 0.182963 0.221055 0.243980 0.250252 0.254236 0.280917 0.333120
chargesum: 0.00000
title: Mulliken charges with hydrogens summed into heavy atoms:
elementType: O N N C C C
charge: -0.251795 0.028841 -0.025512 0.064044 0.001458 0.182963
polarizability: 6.05878804e+01 2.74902832e+00 4.88210266e+01 -1.07158081e+00 -5.75749273e-01 3.20356474e+01
1716.lowfreq: -9.5607 0.0005 0.0005 0.0009 5.9397 14.9526 139.7650 214.9508 432.6574
frequency: 139.7431 214.9456 432.6571 475.6198 556.5692 611.3636 685.4541 794.5021 830.5885 907.0125 949.8061 1013.1923 1055.5134 1086.1651 1163.8977 1199.2818 1265.1606 1277.7443 1304.8642 1362.5341 1425.6088 1450.0890 1481.3411 1658.5070 2962.6336 3022.1239 3086.0010 3107.6413 3355.1696 3557.5379
redmass: 1.9750 4.3446 5.0143 1.5084 2.3132 3.4699 3.9070 1.8881 3.9158 2.2388 2.0037 2.0076 2.2832 1.9688 1.2160 1.2797 3.5165 1.3644 1.1447 1.4336 1.4392 1.0984 1.0910 9.0273 1.0694 1.0651 1.0953 1.0996 1.0768 1.0794
irintensity: 5.3603 1.7007 10.0484 74.5705 93.6286 40.7657 46.0079 38.6524 24.8095 15.5247 18.4343 2.5442 1.3032 10.8931 2.2972 4.6980 88.8765 6.5594 9.3472 11.1122 12.6021 10.1931 2.2717 363.0561 62.3177 12.6062 22.6770 13.2023 1.0433 35.6138
temp: 298.150 k
press: 1.00000 atm
elementType: 8 7 7 6 6 6 1 1 1 1 1 1
symmnumber: 1
zpe: 253807.3 jmol-1
zpe.correction: 0.096670 hartree
zpe.thermalcorrener: 0.102121 hartree
zpe.thermalcorrenthalpy: 0.103065 hartree
zpe.thermalcorrgfe: 0.067828 hartree
zpe.sumelectzpe: -302.138358 hartree
zpe.sumelectthermal: -302.132907 hartree
zpe.sumelectthermalent: -302.131963 hartree
zpe.sumelectthermalfe: -302.167200 hartree
dipole: -4.2045 -0.3066 0.7717
dipole: 4.2857
quadrupole: -43.4275 -29.0672 -36.4354
quadrupole: -0.9920 -3.2917 -0.9117
quadrupole: -7.1175 7.2429 -0.1254 -0.9920 -3.2917 -0.9117
hfenergy: -302.2350283 hartree
pointgroup: C01 [X(C3H6N2O1)]
dipole: 1.6449819 -0.0312114 -0.368958 debye
dipolederiv: -1.3405242 0.1212698 0.0272342 -0.0765285 -0.5040587 -0.012083 0.0582561 -0.0141974 -0.3683909 -0.2255216 0.1704246 -0.0684994 0.0419266 -0.3380794 0.1691204 -0.2149414 0.253947 -0.0997242 -0.3588325 0.085454 0.0602462 0.581897 -0.6391724 -0.1765414 0.1766269 -0.2896125 -0.4328825 0.1184155 0.0614138 0.0372606 0.1166447 0.3175904 -0.0940252 0.0150573 -0.030474 0.2933644 -0.1909382 -0.1748995 -0.0094046 -0.2246647 -0.2139874 -0.0585022 -0.0293585 -0.0536593 0.145027 1.6052871 -0.1963425 -0.0707904 -0.3137363 0.9555187 0.1520492 -0.1226744 0.1207735 0.1651578 0.0635784 0.006806 0.0289436 -0.0323889 -0.018366 0.0476005 0.0910754 0.0983272 -0.194178 -0.0576738 -0.0967122 -0.0656157 -0.082781 0.0256701 -0.0204505 -0.0986338 -0.0386512 0.0401376 0.0724653 0.0554035 -0.0284401 0.0567202 -0.009931 0.0673131 -0.0178763 0.1011963 0.0557221 0.059455 -0.008702 0.0238848 0.007802 0.0859214 -0.0306599 0.0474103 -0.0709428 -0.077047 0.1321593 -0.0188572 0.0676479 -0.0431823 0.1515189 -0.0772426 0.1714455 -0.179926 0.1059175 0.1221297 -0.0052583 -0.0024671 -0.0317088 0.1873753 0.0334216 -0.0763871 0.1032193 0.3668962 unknown
polarizability: 60.6747626|-2.101085|48.5030316|-2.3029292|1.4473531|32.2667601 unknown
InChI: InChI=1S/C3H6N2O/c6-3-1-2-4-5-3/h4-5H,1-2H2
charge 0 multiplicity 1
12 atoms
O  -2.120806 -0.077326 -0.012033
N  1.404143 -0.777022 0.09659
N  -0.004579 -1.109746 -0.163783
C  1.453831 0.709404 -0.215762
C  0.041697 1.213268 0.147137
C  -0.859778 -0.022027 -0.038819
H  1.652159 0.890505 -1.292757
H  2.254096 1.170809 0.383061
H  -0.30334 2.052502 -0.47549
H  -0.033557 1.519684 1.20669
H  1.973942 -1.297684 -0.594179
H  -0.305508 -2.061868 0.054947
