program: Gaussian 09
title: 000151496
version: EM64L-G09RevD.01
frameworkgroup: C1[X(C10H10N2O3)]
method: RPBEPBE
basis: SDD
operation: Freq
keyword: #p
keyword: freq=noraman
keyword: PBEPBE/SDD
title: #p freq=noraman PBEPBE/SDD
converged: YES YES NO NO
title: Mulliken charges:
elementType: O O O N N C C C C C C C C C C H H H H H H H H H H
charge: -0.180154 -0.373760 -0.199045 -0.625915 -0.342066 -0.417740 0.479602 0.135942 0.095946 -0.392936 -0.367496 -0.219276 -0.219799 -0.241149 0.112595 0.304156 0.251127 0.247385 0.230333 0.227651 0.231237 0.309027 0.353019 0.209701 0.391613
chargesum: 0.00000
title: Mulliken charges with hydrogens summed into heavy atoms:
elementType: O O O N N C C C C C C C C C C
charge: -0.180154 0.017852 -0.199045 0.036132 -0.132365 -0.113584 0.479602 0.135942 0.095946 -0.141809 -0.120111 0.011058 0.007853 -0.009912 0.112595
polarizability: 1.41565087e+02 -1.10451342e+01 1.18328344e+02 9.39374846e+00 5.83024404e+00 1.30911501e+02
1716.lowfreq: -10.5027 -5.8748 -4.5564 -0.0004 -0.0004 0.0005 23.4975 30.6354 43.7811
frequency: 23.4187 30.6071 43.7684 68.6245 84.9275 131.6450 148.6042 214.9164 257.8478 297.7549 340.2698 362.2795 393.5155 402.3771 454.5139 479.4537 505.0883 532.7822 542.9004 611.3412 614.6367 632.1189 642.0534 665.6704 701.4990 738.2690 765.4788 802.6721 836.7226 849.5300 866.6225 892.2202 927.4546 977.4007 989.7300 996.7491 1016.4300 1026.8311 1054.5231 1077.4800 1086.9111 1107.5053 1167.2149 1174.3880 1194.0386 1232.0282 1286.8850 1327.6062 1340.3396 1375.3381 1384.1959 1441.4515 1477.4961 1583.5629 1591.9885 1604.3285 1626.5849 1629.2762 1637.8894 3070.2778 3125.3633 3132.9241 3144.7157 3155.2774 3168.1997 3330.5958 3461.8489 3507.7474 3639.0196
redmass: 4.1045 6.5829 12.2134 5.8370 5.8355 6.4340 6.1697 4.6532 5.8070 4.8696 6.7949 8.8984 4.1547 2.9427 1.2998 3.1789 3.9833 3.2692 3.3908 2.1453 1.7280 3.9269 1.3933 4.0354 1.7271 4.8635 2.2352 1.5156 3.6934 1.2671 5.9895 4.1412 1.5111 1.3968 6.0691 1.3295 3.1672 2.3172 1.6027 1.5466 1.5985 2.0322 3.0827 1.0924 1.1157 1.2795 1.7086 1.9771 1.4213 3.4257 6.9534 2.1475 2.1530 2.6869 4.9882 5.0516 10.5081 2.7080 3.0948 1.0833 1.0852 1.0878 1.0926 1.0963 1.1015 1.0762 1.0499 1.0644 1.0998
irintensity: 0.4768 1.0490 0.5559 3.0112 3.2581 0.1261 3.9571 1.9845 7.9583 8.2881 11.5215 2.7959 3.1300 0.0884 66.3160 4.2102 39.0895 33.9217 32.2816 26.4036 19.4891 88.5925 289.0867 10.3567 63.4656 22.7730 32.8082 67.6169 21.6752 0.9984 38.4309 1.3637 3.7419 0.0034 7.3456 2.5595 157.8349 10.0043 270.7300 9.7394 8.0294 13.2860 1.8209 0.0723 1.2588 36.3208 47.3995 0.4168 5.8183 62.1040 0.8671 10.8960 19.9039 190.8563 9.2343 16.3085 231.3444 79.8139 130.9830 2.8656 1.2399 2.2374 16.8536 23.2441 18.0020 27.4288 69.2160 45.2100 48.4096
temp: 298.150 k
press: 1.00000 atm
elementType: 8 8 8 7 7 6 6 6 6 6 6 6 6 6 6 1 1 1 1 1 1 1 1 1 1
symmnumber: 1
zpe: 490503.2 jmol-1
zpe.correction: 0.186823 hartree
zpe.thermalcorrener: 0.200877 hartree
zpe.thermalcorrenthalpy: 0.201821 hartree
zpe.thermalcorrgfe: 0.143719 hartree
zpe.sumelectzpe: -721.136824 hartree
zpe.sumelectthermal: -721.122770 hartree
zpe.sumelectthermalent: -721.121826 hartree
zpe.sumelectthermalfe: -721.179928 hartree
dipole: 0.4701 -0.4310 -2.0977
dipole: 2.1925
quadrupole: -80.4308 -72.7299 -91.7205
quadrupole: -0.1232 -1.6617 -6.3791
quadrupole: 1.1963 8.8971 -10.0934 -0.1232 -1.6617 -6.3791
hfenergy: -721.3236466 hartree
pointgroup: C01 [X(C10H10N2O3)]
dipole: -0.1900304 0.2735841 -0.7956842 debye
dipolederiv: -0.5670393 -0.1377725 0.1379232 -0.1015333 -0.4859216 -0.1064317 0.4622786 -0.042589 -0.6091303 -0.6228844 -0.2958801 0.163273 -0.4579041 -0.9533583 0.3647367 0.1462497 0.3017234 -0.3646471 -0.4400808 -0.1542812 -0.0099219 -0.2021514 -0.5879562 -0.1531004 0.0751219 0.1195043 -0.7683359 -0.6310705 0.0326252 0.0484519 0.1712137 -0.4267898 -0.1462846 0.1329923 0.0487465 -1.0287658 -0.5109614 -0.1403207 0.0671164 -0.0011718 -0.6511739 0.4407437 0.0140059 0.6353407 -0.671182 -0.3621655 -0.0866931 0.1210141 0.1344854 -0.3664987 0.0135467 0.1726126 0.0166012 -0.0476311 0.2766646 -0.14714 0.0108613 -0.3040395 -0.0110787 0.0073057 0.0467915 -0.0186737 -0.0280081 0.0463901 0.0438142 -0.3255998 -0.1716404 0.9699345 -0.1917062 -0.3154788 -0.2018182 1.1243557 0.8645317 0.3235123 -0.1923209 0.4135242 0.5624417 0.1197322 -0.5694069 -0.0229634 0.5699113 -0.1153506 -0.0160003 0.0436516 -0.0783887 -0.0775783 -0.082643 -0.0809597 -0.0489761 0.0457547 -0.1086604 0.0122947 -0.068539 -0.0600206 -0.1387002 0.001902 0.0120937 0.004033 -0.0466978 -0.0249603 -0.0065189 -0.1265354 0.0284679 -0.1280662 -0.0136922 -0.1365988 -0.0031276 0.0422037 -0.041578 -0.0383807 0.0551257 -0.0058104 -0.1045195 -0.0812662 0.0677425 -0.0773703 0.1056852 0.0665095 -0.0666023 0.0187428 -0.0902487 -0.1254717 -0.0322618 0.0619101 -0.0373079 -0.0488444 0.6563497 0.3898355 -0.1843994 0.5835546 1.11183 -0.1804413 -0.1827907 -0.3316824 0.9083551 0.1178447 0.015717 0.0168036 -0.0085876 0.1094808 0.0046536 -0.0390918 -0.0367133 0.0339627 0.0851741 0.0274099 -0.0627651 0.0231563 0.1157891 0.0633303 -0.0422872 0.0478043 -0.0092245 0.0148698 0.0061473 0.0985454 -0.0000372 0.1312541 -0.0041693 0.0814132 -0.0017047 0.0273278 -0.0170896 0.0262 0.1009104 0.0407103 0.1432572 0.0156397 0.1133382 0.0108103 -0.0217398 0.0558789 0.0384282 -0.0383944 0.0460831 0.1227071 0.0725261 -0.0639086 0.0789885 -0.0795642 -0.1050982 0.0851968 -0.0283862 0.0749161 0.1236231 0.0262754 -0.0322773 0.0257286 0.0913132 0.3405842 -0.0128216 0.047484 -0.0190992 0.0677808 -0.0058616 0.0529631 0.0171261 0.2173436 0.3547004 0.0382486 0.0865384 -0.0373461 0.3801977 0.0748315 0.0123598 0.0232163 0.222657 0.2747167 0.0736937 0.0227128 0.0281398 -0.0841063 -0.1139708 0.0349719 -0.3841702 0.173309 0.3927248 -0.0107119 -0.0022925 -0.0062724 0.3029237 -0.0933944 -0.024045 -0.1225265 0.1615922 unknown
polarizability: 143.9134477|-6.8007489|118.6644874|-9.6744255|-8.7851387|128.2269973 unknown
InChI: InChI=1S/C10H10N2O3/c11-9(12)7(8(13)10(14)15)6-4-2-1-3-5-6/h1-5,7,11,14H,12H2
charge 0 multiplicity 1
25 atoms
O  2.08799 0.201608 -1.404456
O  2.5126 2.536531 -0.069507
O  1.733404 1.537963 1.883761
N  1.035835 -2.385484 -1.393967
N  0.38743 -3.017997 0.866135
C  0.591765 -0.67117 0.364411
C  -0.828497 -0.113478 0.094413
C  0.693982 -2.146845 -0.068532
C  1.586549 0.29703 -0.254262
C  -1.770341 -0.092508 1.152495
C  -1.216071 0.333968 -1.194059
C  -3.087817 0.359391 0.921716
C  -2.534876 0.787821 -1.421641
C  -3.474041 0.802047 -0.365398
C  1.936534 1.503126 0.650148
H  0.741504 -0.670254 1.456122
H  -1.47316 -0.448057 2.144574
H  -0.496708 0.328539 -2.021136
H  -3.811862 0.364113 1.743922
H  -2.826664 1.130993 -2.420445
H  -4.49603 1.155399 -0.541974
H  1.076356 -3.340252 -1.746134
H  1.416812 -1.623044 -1.960769
H  0.41403 -4.009048 0.549617
H  2.736278 3.289007 0.544266
