program: Gaussian 09
title: 000151495
version: EM64L-G09RevD.01
frameworkgroup: C1[X(C6H10N2S2)]
method: RPBEPBE
basis: SDD
operation: Freq
keyword: #p
keyword: freq=noraman
keyword: PBEPBE/SDD
title: #p freq=noraman PBEPBE/SDD
converged: YES YES NO NO
title: Mulliken charges:
elementType: S S N N C C C C C C H H H H H H H H H H
charge: 0.212084 -0.013379 -0.001899 -0.020350 -0.644912 -0.423998 -0.399163 -0.615598 -0.624354 -0.113424 0.273720 0.305028 0.292912 0.255301 0.273414 0.239258 0.239657 0.237191 0.268042 0.260469
chargesum: 0.00000
title: Mulliken charges with hydrogens summed into heavy atoms:
elementType: S S N N C C C C C C
charge: 0.212084 -0.013379 -0.001899 -0.020350 -0.066164 -0.423998 0.149050 0.136731 0.141348 -0.113424
polarizability: 1.38615277e+02 -1.35169925e+00 1.21636442e+02 -9.92887967e+00 -1.11588918e+00 7.34865321e+01
1716.lowfreq: -6.7604 -0.0018 -0.0016 0.0028 4.3993 12.5347 33.6467 46.4161 71.7889
frequency: 33.5158 46.3073 71.7370 84.8020 98.5435 123.1198 148.6984 227.4478 255.2050 278.2075 301.4091 351.4699 373.9302 386.3281 422.6226 530.6258 534.5765 547.2587 629.6672 785.7945 847.4276 909.0420 943.5426 970.8899 1042.8351 1050.4205 1083.1259 1134.0180 1135.6079 1168.1012 1219.9476 1239.3454 1290.9519 1324.4210 1381.9189 1405.8558 1424.3770 1445.3386 1454.2257 1467.2720 1476.2800 1484.3259 1504.0368 2200.5350 2978.0758 2984.2801 2990.2815 3023.2765 3049.2980 3064.7285 3066.0414 3111.5935 3116.2708 3119.0654
redmass: 5.4905 3.4230 2.0114 3.8833 1.1575 1.8197 6.0961 3.7978 2.7870 3.0310 6.7176 5.1699 2.7740 4.6587 3.5500 9.3933 4.4434 3.9652 5.6115 2.3328 5.3807 2.3878 4.6899 2.0191 3.0807 1.5542 1.2249 1.5554 1.5143 1.1457 1.1503 3.7583 1.2075 1.3680 2.1114 1.0899 1.1399 1.0806 1.1387 1.0422 1.0737 1.0472 1.5016 12.4188 1.0342 1.0356 1.0595 1.0608 1.0982 1.1023 1.1018 1.1055 1.0994 1.0992
irintensity: 3.8912 4.9849 4.0088 5.1632 0.6011 0.6470 4.2722 3.9375 6.8654 6.0244 1.7181 1.4397 5.1957 18.9981 5.4122 0.0414 3.3542 7.2871 5.0196 3.9856 23.0654 37.7515 91.1114 4.0329 0.6905 19.3102 0.1250 68.1327 51.2781 3.1346 1.3433 44.9064 15.0994 3.9973 90.4989 27.2389 22.0811 17.9732 7.2346 26.0658 12.8535 8.9264 162.2298 12.7533 44.4641 43.3615 10.6287 20.5514 4.4863 23.7550 17.6504 0.6331 16.0717 3.5505
temp: 298.150 k
press: 1.00000 atm
elementType: 16 16 7 7 6 6 6 6 6 6 1 1 1 1 1 1 1 1 1 1
symmnumber: 1
zpe: 402770.8 jmol-1
zpe.correction: 0.153407 hartree
zpe.thermalcorrener: 0.166035 hartree
zpe.thermalcorrenthalpy: 0.166979 hartree
zpe.thermalcorrgfe: 0.112691 hartree
zpe.sumelectzpe: -1139.466876 hartree
zpe.sumelectthermal: -1139.454249 hartree
zpe.sumelectthermalent: -1139.453304 hartree
zpe.sumelectthermalfe: -1139.507593 hartree
dipole: 4.1954 -0.3274 1.1848
dipole: 4.3718
quadrupole: -74.8140 -78.4607 -76.3856
quadrupole: -18.5977 -9.9749 -1.8480
quadrupole: 1.7395 -1.9073 0.1678 -18.5977 -9.9749 -1.8480
hfenergy: -1139.6202836 hartree
pointgroup: C01 [X(C6H10N2S2)]
dipole: 1.5628363 -0.5621712 0.447098 debye
dipolederiv: -0.7155232 -0.1159353 0.1494286 -0.2712205 -0.1834307 0.1353041 0.2197226 0.0522256 -0.1439313 -0.481084 -0.1138124 0.0357766 -0.1029751 -0.8866853 -0.0174445 0.0657208 -0.0125626 -0.2420391 -0.9069778 0.4089687 0.2604188 0.2730849 -0.87782 -0.132512 0.3135136 -0.2420479 -0.3036425 -0.343877 0.0177933 -0.0382966 -0.0689168 -0.1999748 -0.0294078 -0.0669612 0.0178525 -0.2568531 0.2990267 -0.1691238 0.0119991 -0.3846032 0.0988396 -0.0464317 -0.0275576 -0.0456622 0.1580836 1.2125587 -0.1604561 -0.4436197 0.0601287 1.3311214 0.1168166 -0.5183642 0.219037 0.0326087 -0.0255594 -0.0272186 -0.0785314 0.0247782 0.0618326 -0.0016322 0.0069468 0.0003178 0.067901 0.4162256 -0.0834701 -0.061423 0.199091 -0.0908538 -0.090754 -0.0593234 0.0062654 0.2534303 0.0511296 0.0837643 0.0493897 -0.0706481 0.3796088 0.0161195 0.049875 -0.0272127 0.1908752 0.1452484 0.0737917 0.0770411 0.1549429 -0.0120694 0.0942608 0.1208707 0.0489625 -0.0098728 -0.0306263 0.0158622 0.100272 0.0197084 0.0584712 0.0705344 0.0468074 0.0440811 0.0250032 0.0860421 -0.0205087 -0.1016824 0.0948758 -0.00463 -0.0708218 -0.08942 -0.0005443 0.0596068 0.1585057 -0.0935518 0.0723066 -0.0361484 0.0986604 -0.0081911 0.0426514 -0.021789 0.0219261 -0.009235 0.0863375 -0.014078 0.0864563 -0.0176343 -0.0475349 -0.0729607 -0.0387445 0.0794148 0.1862028 0.0143992 -0.0145984 -0.136851 -0.0091835 0.0384389 -0.0364968 -0.0159806 0.1352362 0.001811 0.0213362 0.0159965 0.020047 0.0998654 -0.0933269 0.0911366 -0.0848457 -0.1199217 -0.1074443 0.086665 -0.0244678 0.0968579 0.0751702 0.0746199 -0.0894712 0.0677076 0.0018955 -0.054395 0.1295881 0.0833334 0.0420798 0.045259 -0.0236159 0.0810547 -0.0605971 0.0857011 0.0024258 -0.0860468 -0.1015561 0.0023799 0.030744 0.0051442 -0.089602 0.006034 0.0387594 0.1155457 -0.0683827 0.0222908 -0.0030676 0.002709 0.0104345 0.0118575 0.0875033 -0.0741814 unknown
polarizability: 138.0363211|-3.5367772|121.2463591|-7.7791011|9.1873651|74.455571 unknown
InChI: InChI=1S/C6H10N2S2/c1-8(2)6(9)10-5-3-4-7/h3,5H2,1-2H3
charge 0 multiplicity 1
20 atoms
S  -0.479436 -0.829463 1.116397
S  1.379734 1.657335 0.621671
N  2.018891 -0.967212 0.118752
N  -3.888107 -0.19781 -0.975713
C  -1.502942 0.688998 1.540024
C  1.116385 -0.034196 0.560504
C  -2.136112 1.356066 0.298363
C  3.363922 -0.578677 -0.3572
C  1.714645 -2.417639 0.100012
C  -3.100881 0.495563 -0.406696
H  -2.260949 0.322476 2.251051
H  -0.820394 1.403842 2.030652
H  -1.327837 1.66272 -0.391955
H  -2.655172 2.282028 0.616305
H  3.460008 0.515794 -0.308182
H  3.50429 -0.913931 -1.401321
H  4.13941 -1.042693 0.279983
H  2.574079 -2.951107 -0.333616
H  0.819924 -2.625757 -0.514332
H  1.537043 -2.801936 1.121401
