program: Gaussian 09
title: 000151492
version: EM64L-G09RevD.01
frameworkgroup: C1[X(C6H12O3)]
method: RPBEPBE
basis: SDD
operation: Freq
keyword: #pfreq=noraman
keyword: PBEPBE/SDD
title: #p freq=noraman PBEPBE/SDD
converged: YES YES NO NO
title: Mulliken charges:
elementType: O O O C C C C C C H H H H H H H H H H H H
charge: -0.470794 -0.403847 -0.262656 -0.036881 -0.362520 -0.357454 -0.516717 -0.697210 0.201341 0.190854 0.182660 0.204292 0.243625 0.183545 0.267646 0.250333 0.203431 0.217971 0.213029 0.367898 0.381454
chargesum: 0.00000
title: Mulliken charges with hydrogens summed into heavy atoms:
elementType: O O O C C C C C C
charge: -0.102896 -0.022393 -0.262656 0.153972 0.024433 0.069716 0.001262 -0.062779 0.201341
polarizability: 9.56426687e+01 6.90502095e-01 7.25217353e+01 1.72534307e+00 -1.23241332e+00 5.72311569e+01
1716.lowfreq: -13.4632 -9.6569 -0.0013 -0.0012 -0.0009 0.3154 45.3469 61.5813 77.2827
frequency: 45.3201 61.5718 77.2293 102.6807 139.7416 222.6425 228.9174 290.1462 332.7217 355.3301 448.4287 494.1953 537.7497 572.1565 622.0574 668.1997 740.2122 823.8550 851.8561 859.0070 908.2042 970.6342 1019.9388 1044.8730 1060.9122 1082.1788 1103.4447 1128.9791 1193.0923 1222.7703 1235.9898 1266.1884 1283.5315 1295.5960 1327.0917 1343.5017 1357.6214 1386.8841 1397.9660 1414.0126 1447.8516 1475.0080 1477.4831 1485.9733 1640.8146 2930.9505 2965.6583 2970.3635 2974.9406 2993.3587 3023.3577 3045.6076 3065.0541 3071.7484 3072.9507 3471.0059 3502.3049
redmass: 4.1199 3.7805 2.3107 2.7731 2.8792 3.9986 1.1502 4.2148 5.2195 3.4715 1.9059 2.3088 3.0799 1.0605 2.3289 1.8015 1.1431 2.3923 3.8532 1.5562 1.9846 1.7581 3.6376 2.0992 2.3476 2.3314 1.6596 2.3527 1.3029 1.2747 1.4243 1.2320 1.2041 1.1511 1.2504 1.7445 1.7289 1.2499 1.6413 1.1206 1.0848 1.0512 1.0437 1.0804 7.6536 1.0837 1.0570 1.0381 1.0667 1.0626 1.0960 1.0990 1.0969 1.0988 1.1008 1.0652 1.0638
irintensity: 0.5477 0.4805 0.8497 1.9904 1.2369 2.2257 0.1897 3.5004 6.3306 0.6883 11.2449 13.6993 66.1758 188.9373 59.2237 104.0765 3.3108 25.0075 2.4324 3.5512 2.3887 10.5998 20.9176 12.1865 223.3189 95.5551 2.7325 31.3472 1.1205 14.9657 6.5554 29.7305 11.3059 8.0416 8.5548 42.2137 29.6546 25.2981 40.4666 30.7757 8.8532 4.0269 11.5241 14.5582 197.4542 46.9165 13.0346 47.2283 42.2658 9.8181 25.5651 0.4728 3.8742 51.7259 93.9964 59.6470 17.9758
temp: 298.150 k
press: 1.00000 atm
elementType: 8 8 8 6 6 6 6 6 6 1 1 1 1 1 1 1 1 1 1 1 1
symmnumber: 1
zpe: 461351.0 jmol-1
zpe.correction: 0.175719 hartree
zpe.thermalcorrener: 0.186448 hartree
zpe.thermalcorrenthalpy: 0.187392 hartree
zpe.thermalcorrgfe: 0.138620 hartree
zpe.sumelectzpe: -460.773718 hartree
zpe.sumelectthermal: -460.762989 hartree
zpe.sumelectthermalent: -460.762045 hartree
zpe.sumelectthermalfe: -460.810817 hartree
dipole: -1.3259 -2.2221 -0.7140
dipole: 2.6843
quadrupole: -48.3570 -59.9935 -55.0899
quadrupole: 0.3019 -0.5342 -0.5510
quadrupole: 6.1231 -5.5133 -0.6098 0.3019 -0.5342 -0.5510
hfenergy: -460.949437 hartree
pointgroup: C01 [X(C6H12O3)]
dipole: -0.5269491 -0.7383986 -0.5407253 debye
dipolederiv: -0.5244787 -0.0793104 0.1403603 -0.0765717 -0.6849261 -0.1395521 0.1297848 -0.1655093 -0.580425 -1.0000081 -0.5345882 -0.1469485 -0.4921125 -0.5911254 -0.0813544 -0.1744608 -0.093428 -0.4492412 -0.7399075 0.1347753 -0.005253 -0.1689898 -0.9852161 -0.1358246 -0.1024857 -0.0923523 -0.3377153 0.4545529 0.0197457 -0.0759656 0.0672747 0.4681929 0.1391628 -0.0687581 0.0997061 0.501178 -0.1073995 0.0335632 0.028621 -0.0285286 0.0569909 0.0191608 -0.0023697 0.0408578 0.1584101 0.0388508 0.0066604 -0.0087201 0.0637571 0.0592651 -0.0202012 -0.0078681 -0.0112192 0.1615025 -0.399668 0.0145536 -0.0409459 0.1529087 -0.1774887 -0.0112188 -0.0483849 0.0150125 0.0814835 -0.0709587 0.0338721 -0.0048245 -0.0025406 0.0687033 0.0217741 0.0032991 0.019801 0.0965072 1.4532141 0.1618352 0.1821278 0.3116691 1.3356213 0.2235803 0.2860751 0.2040224 0.2629767 0.0185558 -0.0037119 -0.0155451 -0.0047151 -0.0450424 0.0750194 -0.0023213 0.0431503 -0.2178106 0.0476197 -0.0188308 -0.0066473 -0.0231547 -0.0890607 -0.1102241 -0.0081032 -0.1388143 -0.0262817 0.0422319 0.0024469 0.0014689 -0.015013 0.0277026 0.0836353 -0.0064494 0.1139176 -0.1167964 0.0788929 0.0136768 0.0055422 -0.0052656 -0.0606651 -0.0822896 -0.0122489 -0.1053556 0.0168444 0.0163531 0.0194436 -0.0477571 0.0020432 0.0257769 0.0916908 -0.0187524 0.1211265 -0.1615845 0.0817127 0.0224176 -0.0091139 -0.0088384 0.0819354 0.0484003 0.0341276 0.0804657 -0.0162347 0.0713835 -0.0058463 -0.0080173 -0.0239177 0.0110345 -0.0950972 0.0056124 -0.1125146 0.0144514 0.0683738 0.0003006 -0.0176444 0.0651453 -0.0936818 -0.129307 0.0210514 -0.1427197 -0.0217126 -0.1540423 -0.1027202 0.0371255 -0.1394093 -0.0043648 0.031993 0.0465277 0.0302889 0.0900668 0.076244 0.0117757 0.0042369 0.0446677 0.0465693 0.0848522 -0.0543325 0.0981729 -0.1486338 0.3259313 0.1658792 -0.0179863 0.1228461 0.3475786 0.0053294 -0.0219063 0.0239902 0.3028599 0.2225464 0.1040621 0.0058866 0.158745 0.2022003 -0.0195291 0.0019631 -0.0285991 0.3901553 unknown
polarizability: 95.676412|0.1458344|71.7018057|1.4722134|3.657742|58.0173433 unknown
InChI: InChI=1S/C6H12O3/c1-2-3-5(7)4-6(8)9/h5,7-8H,2-4H2,1H3
charge 0 multiplicity 1
21 atoms
O  0.243451 1.193279 0.976621
O  -3.32622 -0.945817 -0.292127
O  -2.476705 1.15275 0.18733
C  0.257467 0.188729 -0.095503
C  1.600053 -0.551629 0.005126
C  2.81111 0.365069 -0.272805
C  -0.940419 -0.78433 0.047335
C  4.158691 -0.367794 -0.103356
C  -2.276448 -0.07361 -0.004705
H  0.188951 0.693448 -1.086585
H  1.601862 -1.402026 -0.707989
H  1.684862 -0.976928 1.025512
H  2.757077 1.231504 0.411149
H  2.735005 0.768548 -1.30369
H  -0.873288 -1.300863 1.026245
H  -0.922002 -1.567962 -0.731244
H  4.236891 -1.231156 -0.791949
H  5.01055 0.305855 -0.309441
H  4.273915 -0.75014 0.928523
H  -0.617169 1.690074 0.902884
H  -4.187734 -0.444699 -0.287731
