program: Gaussian 09
title: 000151486
version: EM64L-G09RevD.01
frameworkgroup: C1[X(C10H12BrNO2)]
method: RPBEPBE
basis: SDD
operation: Freq
keyword: #p
keyword: freq=noraman
keyword: PBEPBE/SDD
title: #p freq=noraman PBEPBE/SDD
converged: YES YES NO NO
title: Mulliken charges:
elementType: Br O O N C C C C C C C C C C H H H H H H H H H H H H
charge: 0.012940 -0.292735 -0.365452 -0.399064 -0.016360 -0.711435 -0.673006 0.178384 0.134321 0.141021 -0.314751 -0.267370 -0.215176 -0.202141 0.242585 0.360593 0.220987 0.210527 0.240280 0.256241 0.210004 0.203389 0.293323 0.264279 0.243663 0.244955
chargesum: 0.00000
title: Mulliken charges with hydrogens summed into heavy atoms:
elementType: Br O O N C C C C C C C C C C
charge: 0.012940 -0.292735 -0.365452 -0.038470 0.226224 -0.039640 -0.003373 0.178384 0.134321 0.141021 -0.021428 -0.003092 0.028487 0.042814
polarizability: 1.85602371e+02 -2.86171485e+01 2.12503511e+02 6.54685846e+00 1.43506007e+00 8.19343808e+01
1716.lowfreq: -13.9374 -6.0779 0.0003 0.0003 0.0006 4.9269 19.1201 39.0013 51.0841
frequency: 14.6146 38.8989 51.0812 83.4012 91.9043 108.0404 139.6489 207.7395 211.9258 237.5397 256.0144 280.5496 331.9353 367.9515 387.1097 398.0714 431.5589 478.8324 515.8330 531.9947 562.8681 629.7892 667.6433 714.8260 766.9354 784.6569 800.6101 834.7037 858.6971 897.4633 920.6097 939.8274 954.6852 980.2824 1009.5747 1025.7135 1075.9265 1127.2694 1138.9771 1149.8262 1165.8142 1178.0173 1183.1477 1236.3963 1269.5297 1307.2883 1351.4328 1374.4644 1376.9770 1391.8492 1414.3036 1445.4084 1460.5857 1468.2084 1473.6820 1487.6993 1495.3816 1536.6018 1567.6293 1591.9856 2978.8750 2983.2843 3015.1563 3072.6385 3082.6188 3092.6969 3099.6983 3141.0889 3152.0714 3162.4103 3176.1206 3431.6688
redmass: 3.0711 8.8415 4.7116 6.3791 4.5368 4.0416 5.1012 1.1105 4.5602 1.9310 1.6834 3.7303 8.2912 3.9073 5.8041 2.9497 3.1784 3.4527 5.1824 4.7094 4.9232 6.3203 3.5199 1.1053 3.3719 2.1817 3.1101 3.4581 3.5686 1.4922 1.2224 1.6455 1.8322 1.3711 1.3719 2.1515 3.1260 2.0327 2.1307 2.1047 1.7176 1.6943 2.0759 1.6672 1.9511 1.6103 1.2361 1.2073 7.1305 1.2290 2.1276 2.5781 1.0822 1.0454 1.1342 1.0507 1.7084 5.6388 6.7082 6.0735 1.0368 1.0360 1.0844 1.0990 1.0993 1.0998 1.1002 1.0864 1.0898 1.0949 1.1008 1.0798
irintensity: 0.9926 0.5016 4.6880 2.4516 1.7983 3.2081 7.7907 1.9155 21.0568 9.4168 4.5861 9.0911 35.1972 6.7742 37.4218 1.7733 1.1930 3.8147 34.9907 15.7153 1.9144 0.7411 43.0207 64.8497 3.1731 33.2498 27.3896 6.8976 4.6386 1.9744 2.1707 2.5464 6.1719 1.2394 4.2882 4.3232 2.7817 31.2945 11.2303 42.9482 14.3537 40.7855 29.1798 8.0713 29.3106 4.4915 3.1583 24.9592 20.8611 31.6821 6.4431 47.0629 15.9754 6.3362 45.2561 30.3538 141.3759 31.1128 142.5436 27.9669 16.3397 34.8801 3.6898 10.5855 59.0315 35.7920 21.7865 3.7773 1.5072 5.6456 22.8104 51.0025
temp: 298.150 k
press: 1.00000 atm
elementType: 35 8 8 7 6 6 6 6 6 6 6 6 6 6 1 1 1 1 1 1 1 1 1 1 1 1
symmnumber: 1
zpe: 527375.3 jmol-1
zpe.correction: 0.200867 hartree
zpe.thermalcorrener: 0.215523 hartree
zpe.thermalcorrenthalpy: 0.216467 hartree
zpe.thermalcorrgfe: 0.156278 hartree
zpe.sumelectzpe: -605.859106 hartree
zpe.sumelectthermal: -605.844450 hartree
zpe.sumelectthermalent: -605.843505 hartree
zpe.sumelectthermalfe: -605.903695 hartree
dipole: 2.2165 -0.1579 0.9967
dipole: 2.4354
quadrupole: -72.5305 -96.7036 -95.8134
quadrupole: -11.0569 -1.1880 -3.9060
quadrupole: 15.8187 -8.3544 -7.4643 -11.0569 -1.1880 -3.9060
hfenergy: -606.0599724 hartree
pointgroup: C01 [X(C10H12Br1N1O2)]
dipole: -0.9278671 -0.2359371 -0.0385498 debye
dipolederiv: -0.1745682 0.0008437 0.3852074 -0.2564056 -0.1134144 0.7112442 0.4140362 0.0435456 -1.0586646 -0.6190802 -0.0522033 -0.2454922 0.010832 -0.4935527 -0.2445261 0.0640143 -0.2428749 -0.6925243 -0.0693045 0.0886137 -0.8821443 0.1098529 -0.1799035 -0.3670586 -0.6576964 -0.1865521 1.1723515 -0.8170073 0.2456942 0.1173025 0.2457047 -0.4939031 -0.038676 0.199631 -0.0999491 -0.555487 0.6983787 -0.1568019 -0.0058739 0.0098635 0.249641 -0.089826 -0.0302602 -0.0449736 0.2301884 -0.0697584 0.0525735 0.0360285 0.0021198 0.0869349 0.0434033 0.0310928 0.032307 -0.0760493 -0.0781073 0.0752344 0.0305562 -0.0103614 0.0205991 0.0898675 0.0519925 0.0680084 -0.0542023 1.0163476 -0.1246486 0.195075 -0.1187117 0.4368857 0.4272074 -0.1463422 0.4272306 0.8052564 -0.1437186 -0.0589994 -0.0059035 -0.2636034 0.0410699 0.2116572 -0.4643004 -0.0610293 0.1635833 -0.0223522 -0.0547164 0.5327396 0.2629179 0.069814 -0.5473899 0.3180645 0.1474791 -0.3069176 -0.5553541 0.0574709 0.3316969 0.0765728 -0.0851746 -0.0305148 0.1555417 0.0350935 0.0114048 -0.0072979 0.0437697 -0.4356152 0.0349539 -0.0527259 0.1541668 0.0827805 0.0767316 0.0952832 0.2917784 -0.0729412 -0.0486151 -0.0459081 -0.0595585 0.1305954 0.0024668 0.1018445 0.1905324 0.1865242 -0.0021476 -0.0086901 0.0031499 -0.1351171 -0.1834317 -0.017325 0.0174112 -0.4574971 -0.011124 0.0240125 0.0115069 -0.0467036 -0.0831705 -0.0184634 -0.02628 -0.0542568 0.0304321 0.2762592 -0.008888 0.056557 -0.0588403 0.2567494 -0.0379826 0.0751648 -0.051924 0.1709219 -0.1915381 0.0157004 0.0043508 0.0194222 0.0992641 -0.0130753 -0.0367677 -0.0168871 0.0925436 0.0839059 -0.0946914 -0.0377731 -0.0557324 -0.105039 -0.0900262 0.011005 -0.0508234 0.0310978 0.1175479 0.0496181 -0.0621657 0.0490424 -0.0356454 0.0944157 -0.0163109 0.1051916 -0.0355496 0.0866974 -0.0095914 0.1117916 -0.0151418 0.0888724 -0.0366327 0.0867786 0.0070046 -0.0592724 -0.216785 0.0302648 -0.0636797 0.0281418 0.0599796 0.0119247 -0.0676715 0.0307927 0.0930537 0.0837612 -0.0701403 -0.0366021 -0.0214502 -0.1182529 -0.0336741 -0.0285377 -0.1080014 0.0345071 0.1611029 -0.0253201 -0.0413298 0.0364344 0.1365497 -0.0472627 -0.0226181 -0.0308169 0.0662741 0.059905 -0.0013848 -0.0157312 -0.0510534 0.1326477 -0.0429053 -0.0413393 -0.0545239 0.0159999 0.0216691 0.040994 0.0765292 0.0418585 0.1248709 -0.0254766 0.08828 -0.0682139 -0.0089859 -0.1078818 0.0076847 0.0002745 0.0130455 0.1515791 -0.0275603 -0.0253994 -0.021814 0.1017199 unknown
polarizability: 191.3300179|-12.689169|83.019671|-30.1208701|7.1530262|205.6905744 unknown
InChI: InChI=1S/C10H12BrNO2/c1-7(2)12-10(13)8-5-3-4-6-9(8)14-11/h3-7,12H,1-2H3
charge 0 multiplicity 1
26 atoms
Br 0.018943 0.952466 -3.600709
O  1.337493 1.397824 1.653292
O  -0.462205 -0.261663 -1.918942
N  1.743543 0.231676 -0.319892
C  3.211625 0.189488 -0.126467
C  3.895397 0.005388 -1.495215
C  3.602236 -0.920252 0.880029
C  0.911188 0.84155 0.585917
C  -0.578912 0.827203 0.280358
C  -1.201794 0.351379 -0.927842
C  -1.425455 1.297274 1.311073
C  -2.620226 0.407498 -1.090539
C  -2.827623 1.337878 1.153032
C  -3.431757 0.886186 -0.051827
H  3.49876 1.164032 0.311736
H  1.31814 -0.220646 -1.139614
H  4.992606 0.013968 -1.373901
H  3.615041 -0.962906 -1.952711
H  3.616043 0.813701 -2.194144
H  3.085339 -0.76194 1.841474
H  4.692045 -0.901261 1.06438
H  3.332914 -1.918178 0.487479
H  -0.938348 1.640467 2.230103
H  -3.041898 0.060976 -2.039706
H  -3.453145 1.726471 1.963845
H  -4.519551 0.916621 -0.170509
