program: Gaussian 09
title: 000151480
version: EM64L-G09RevD.01
frameworkgroup: C1[X(C11H10N2O3)]
method: RPBEPBE
basis: SDD
operation: Freq
keyword: #p
keyword: freq=noraman
keyword: PBEPBE/SDD
title: #p freq=noraman PBEPBE/SDD
converged: YES YES NO NO
title: Mulliken charges:
elementType: O O O N N C C C C C C C C C C C H H H H H H H H H H
charge: -0.242382 -0.415889 -0.233146 -0.414826 0.021778 -0.478403 0.022533 0.368371 0.035952 -0.505600 0.049002 -0.380398 -0.335159 -0.204446 -0.232257 0.192684 0.249794 0.249233 0.263547 0.302843 0.334485 0.236062 0.265745 0.235645 0.238767 0.376067
chargesum: 0.00000
title: Mulliken charges with hydrogens summed into heavy atoms:
elementType: O O O N N C C C C C C C C C C C
charge: -0.242382 -0.039823 -0.233146 -0.080342 0.021778 0.020625 0.022533 0.368371 0.035952 0.060790 0.049002 -0.144336 -0.069414 0.031198 0.006510 0.192684
polarizability: 2.37247069e+02 -2.02545273e+01 1.32647654e+02 1.46918593e+01 4.02722756e+00 7.95302941e+01
1716.lowfreq: -11.5504 -6.1294 -0.0007 0.0004 0.0007 0.9592 28.6423 33.2756 54.2752
frequency: 28.5970 33.1648 54.2674 82.6076 114.6328 138.3233 183.4295 249.6610 251.2891 310.0583 326.4236 393.9494 448.6445 460.0240 474.1549 482.3084 506.0244 556.4730 564.7519 583.1930 592.2415 637.5613 690.8646 700.2718 725.4201 746.4105 768.7131 775.6488 791.8365 835.8834 867.5762 881.8663 896.2789 954.0672 988.1007 1006.0899 1022.3110 1035.4070 1078.6230 1112.5100 1132.1045 1168.1539 1184.1201 1224.0051 1241.7301 1259.8190 1265.7548 1272.8678 1302.7632 1312.4919 1367.5554 1375.2961 1408.0150 1439.3453 1448.2533 1467.5347 1473.4453 1534.9636 1579.5164 1613.8822 1619.7378 1667.0766 3003.9875 3017.7076 3059.9866 3100.1832 3127.8595 3147.3122 3161.5745 3177.9838 3500.5086 3514.6132
redmass: 11.4986 5.9644 5.3970 2.4206 5.4492 5.3434 8.5961 3.2123 4.5621 5.8319 5.9066 4.9887 7.9711 3.6145 4.3312 4.0678 1.8657 4.1632 4.1798 5.0413 8.1027 1.3686 3.7632 4.6038 2.1021 2.5663 1.7121 1.3336 4.3968 3.3441 1.5416 4.4283 5.4767 1.3776 1.3272 2.6814 2.1783 2.7693 2.3949 1.7549 2.2913 1.1289 1.6171 2.3337 1.4777 1.6903 1.4374 1.8880 2.1376 2.2092 1.8106 2.5952 3.9236 1.1003 1.1133 3.2282 2.5548 9.9001 6.9287 4.9762 7.0832 8.1420 1.0604 1.0617 1.0988 1.1009 1.0883 1.0893 1.0940 1.1000 1.0769 1.0639
irintensity: 0.7527 0.8770 1.4034 0.6945 3.3096 1.8908 1.1662 1.0176 5.6319 6.3877 2.0501 5.3959 9.0382 20.1371 43.7107 8.8281 38.9950 1.0188 0.5454 15.7902 14.5213 121.7355 1.1413 1.3292 9.3920 0.7640 10.5100 180.6816 17.2284 9.3322 1.0457 3.1737 2.8390 5.0452 0.0341 57.4686 26.1995 139.6992 108.8291 18.1529 24.2907 2.5044 15.9761 3.6196 5.9153 2.2888 25.2183 7.9019 100.1152 1.8821 44.3701 4.1634 6.0090 2.3764 50.0168 19.5625 1.7228 41.0261 8.1761 450.5843 0.7568 226.9916 16.5587 9.9575 5.0118 6.1892 4.9014 7.1859 13.5453 17.1871 32.0589 21.2271
temp: 298.150 k
press: 1.00000 atm
elementType: 8 8 8 7 7 6 6 6 6 6 6 6 6 6 6 6 1 1 1 1 1 1 1 1 1 1
symmnumber: 1
zpe: 511522.0 jmol-1
zpe.correction: 0.194828 hartree
zpe.thermalcorrener: 0.208480 hartree
zpe.thermalcorrenthalpy: 0.209425 hartree
zpe.thermalcorrgfe: 0.152473 hartree
zpe.sumelectzpe: -759.238867 hartree
zpe.sumelectthermal: -759.225215 hartree
zpe.sumelectthermalent: -759.224271 hartree
zpe.sumelectthermalfe: -759.281223 hartree
dipole: 4.6739 0.2055 1.9568
dipole: 5.0711
quadrupole: -74.5025 -91.5088 -98.2207
quadrupole: 5.4685 -5.2920 -0.4279
quadrupole: 13.5748 -3.4314 -10.1434 5.4685 -5.2920 -0.4279
hfenergy: -759.4336953 hartree
pointgroup: C01 [X(C11H10N2O3)]
dipole: 1.8455529 -0.094156 0.7521069 debye
dipolederiv: -1.0465508 0.299213 0.0080658 0.6972425 -0.929494 -0.0383757 0.1550279 -0.0884735 -0.367736 -0.8623931 -0.0277491 0.5439347 -0.0777784 -0.4257256 0.0813007 0.5793156 0.0646845 -0.8939232 -0.8173655 -0.0456821 -0.2403328 -0.0855862 -0.308464 -0.0465859 0.0019885 -0.0043775 -0.9371784 -0.8604096 0.4869832 0.0543798 -0.0368919 -0.3331804 -0.0077118 -0.0979294 0.0654204 -0.2892713 0.0493861 -0.1536945 0.0286704 0.0988836 -0.2160718 0.0004627 0.0814703 -0.0266838 -0.2175715 -0.2633716 0.0105979 -0.006527 0.1270436 0.0874213 -0.0007442 0.0577491 -0.0060169 0.0315446 0.7249995 0.035155 0.0579446 0.5561555 -0.1190869 0.0273266 0.2940231 -0.0393806 0.038003 0.2636049 -0.4155064 -0.0875323 -0.1373773 0.2910084 0.011633 -0.019984 -0.025201 0.1226503 -0.1774173 0.0774827 -0.0086499 -0.1234522 -0.0356773 -0.0380754 -0.0741746 -0.0084859 0.0344425 -0.4250003 -0.0792315 -0.0667358 -0.2431127 0.0876841 -0.0478835 -0.4236217 -0.0758963 -0.0384149 1.1891729 -0.5045908 -0.0118793 -0.935403 0.8649861 0.0398569 -0.1495881 0.0947676 0.2645381 -0.0982286 0.2134108 0.0748798 0.0517314 -0.0098985 0.0601444 0.0315574 0.0893769 -0.1722013 0.2293193 0.0035936 0.0576756 -0.1415833 0.1331384 0.0583783 0.0162246 0.0736887 -0.0989091 0.0504671 -0.002384 0.0343347 0.2272821 0.0649526 0.0857426 0.0936947 0.0535173 -0.095329 -0.2733926 -0.0829421 -0.0329591 -0.285511 -0.0032703 0.0081847 -0.0971163 0.0361496 -0.1804136 1.6273285 0.1548176 -0.1448863 0.2499335 0.2214964 -0.000625 -0.2055758 -0.0168173 1.5021731 0.0642752 0.0087315 0.0133602 -0.0454225 -0.038624 -0.0721596 0.0114588 -0.0473541 0.0467587 0.0704312 0.0205876 -0.0374626 -0.0083264 0.0281172 0.0819723 0.0065061 0.0564531 0.0254416 0.0612797 0.0267747 -0.0145479 0.0280943 0.0346461 0.099347 0.0357763 0.0796355 0.0059748 0.1776924 0.0006208 -0.0056503 0.103252 0.0350986 -0.0699117 -0.0198212 -0.032886 0.0807273 0.1261266 -0.0026053 -0.0301733 0.0202715 0.1850051 -0.0351896 -0.0248134 -0.0403958 0.2980188 0.0648553 -0.0058602 -0.0185453 -0.0663349 -0.071089 -0.0779177 -0.0372233 -0.0700462 0.1471842 0.0955596 -0.0615196 -0.0290985 -0.0194101 -0.0035038 -0.0484574 -0.0158982 -0.055549 0.1372425 -0.1038181 -0.0227741 -0.0482087 -0.0274864 0.0937836 -0.0228159 -0.0509335 -0.0219997 0.1438066 -0.0123346 0.1007586 0.0006787 0.108983 -0.0122614 -0.0339849 0.0010044 -0.034267 0.1584278 0.1457837 -0.0341872 -0.0907352 -0.0351967 0.3790094 -0.0139106 -0.1491175 -0.0198628 0.2540144 unknown
polarizability: 236.9041725|-23.8618092|129.5517346|9.0097771|14.125043|82.96911 unknown
InChI: InChI=1S/C11H10N2O3/c14-10(15)6-5-9-11(16)13-8-4-2-1-3-7(8)12-9/h1-4,13-14H,5-6H2
charge 0 multiplicity 1
26 atoms
O  -0.946543 2.35827 0.189294
O  -5.068738 -0.51525 1.325918
O  -4.791906 -0.49161 -0.979013
N  1.251378 1.580368 0.31949
N  0.407263 -0.955787 -0.541767
C  -1.928937 -0.231607 -0.744307
C  -0.479552 0.02556 -0.410267
C  2.217192 0.575534 0.193382
C  1.761105 -0.711646 -0.245897
C  -2.835644 -0.160329 0.508205
C  -0.118584 1.405389 0.047776
C  3.587663 0.795707 0.480791
C  2.703111 -1.764446 -0.388571
C  4.499453 -0.265049 0.331434
C  4.061377 -1.546944 -0.103037
C  -4.289695 -0.402892 0.162709
H  -2.005042 -1.223383 -1.218323
H  -2.284424 0.524729 -1.468435
H  -2.530282 -0.896658 1.274061
H  -2.757268 0.840128 0.974438
H  1.526348 2.518635 0.629935
H  3.930057 1.782012 0.815753
H  2.330424 -2.73617 -0.725996
H  5.559088 -0.098985 0.552954
H  4.784315 -2.360879 -0.214455
H  -6.020459 -0.652696 1.066927
