program: Gaussian 09
title: 000151475
version: EM64L-G09RevD.01
frameworkgroup: C1[X(C13H19N5O4)]
method: RPBEPBE
basis: SDD
operation: Freq
keyword: #p
keyword: freq=noraman
keyword: PBEPBE/SDD
title: #p freq=noraman PBEPBE/SDD
converged: YES YES NO NO
title: Mulliken charges:
elementType: O O O O N N N N N C C C C C C C C C C C C C H H H H H H H H H H H H H H H H H H H
charge: -0.251798 -0.258502 -0.245716 -0.216469 -0.566692 -0.115910 -0.329945 -0.663959 0.133108 -0.351879 -0.252816 -0.421342 -0.467279 0.237460 -0.483499 0.463621 -0.370884 -0.363629 0.325892 -0.267376 -0.221475 -0.274978 0.241232 0.213190 0.253574 0.236727 0.207895 0.226636 0.195647 0.272670 0.287126 0.225085 0.238358 0.237746 0.260236 0.262009 0.230511 0.259765 0.401424 0.346161 0.368072
chargesum: 0.00000
title: Mulliken charges with hydrogens summed into heavy atoms:
elementType: O O O O N N N N N C C C C C C C C C C C C C
charge: -0.251798 -0.258502 -0.245716 -0.216469 -0.006896 -0.115910 0.071479 0.050274 0.133108 0.102543 0.000758 0.023281 -0.044996 0.237460 -0.020056 0.463621 -0.133138 -0.103393 0.325892 -0.005367 0.009036 -0.015213
polarizability: 2.51510577e+02 -2.21407004e+01 1.81780261e+02 6.20495287e+00 -1.00610160e+01 1.49204570e+02
1716.lowfreq: -15.5168 -9.7158 -1.9066 0.0005 0.0007 0.0009 14.6125 29.2136 32.4483
frequency: 10.0557 29.1749 32.4388 36.9303 46.7554 59.0380 65.9890 73.0415 88.8451 104.2035 133.5533 151.1950 165.2240 190.2068 197.1301 210.5410 251.8660 260.9512 278.4684 296.8565 313.4697 349.1883 360.3682 400.0820 402.1567 405.7639 434.1036 456.8663 492.2855 544.2801 592.7942 616.1598 626.1743 632.4294 635.1839 639.2620 651.2320 690.7287 698.6348 703.3518 704.2931 739.2480 757.2395 765.4166 792.6828 817.9668 843.4517 858.8480 868.8239 897.9608 908.8347 935.5889 948.2091 976.8179 981.4255 990.0169 1003.4561 1006.3126 1024.4527 1031.0344 1051.1667 1079.5309 1088.9826 1101.4113 1123.0293 1146.3277 1160.3808 1172.6413 1183.6067 1187.7105 1211.8433 1219.4298 1228.2366 1243.9734 1261.8883 1299.8628 1306.6119 1315.5308 1327.9138 1337.3538 1347.9629 1363.4357 1368.9225 1372.5992 1383.3353 1440.3146 1451.5723 1455.1318 1461.9744 1471.0591 1477.4849 1482.1462 1584.2190 1590.2941 1612.3588 1624.0011 1652.0038 1659.0564 2882.9058 2939.5529 2990.7681 2995.6575 3036.3931 3040.6273 3044.6628 3068.9505 3111.9093 3125.6057 3131.2858 3143.9641 3154.7831 3168.2944 3416.9038 3446.0301 3465.8765 3564.5197 3672.8296
redmass: 5.5355 5.2739 5.1201 4.7270 6.9538 6.8673 6.8971 7.1785 6.8245 6.7929 3.5888 4.6868 3.6106 3.8569 4.7108 1.2028 5.0159 2.3359 3.5283 4.6087 2.7025 3.5228 2.5319 2.8214 5.2623 4.2869 1.1743 3.3627 4.1021 3.4991 4.3092 6.2390 3.3284 2.0188 4.5601 2.7087 2.0273 1.6285 1.6684 3.9513 2.0315 3.5868 2.0513 1.9216 2.3753 3.3846 3.5211 1.2810 3.9715 2.4145 6.4294 1.4815 2.4688 1.8944 1.4418 5.2780 1.3103 3.1010 2.2262 2.1850 1.8778 2.9421 1.5312 2.3393 2.5758 1.8398 1.7451 1.0598 1.3070 1.1199 6.3891 2.5236 1.2301 1.3227 1.4966 1.2094 2.7548 1.2841 1.2625 1.2546 1.4494 1.3867 2.0393 1.9309 8.1300 2.1601 1.0871 1.0787 1.1381 1.0938 2.2431 2.2671 1.2426 6.0790 6.0561 9.4382 1.1042 5.4560 1.0596 1.0965 1.0608 1.0602 1.0585 1.0850 1.1001 1.1045 1.1077 1.0878 1.0869 1.0917 1.0962 1.1013 1.0814 1.0453 1.0528 1.0962 1.0971
irintensity: 0.3461 0.1610 1.8134 0.8747 0.6073 0.5027 0.5177 0.7610 3.5874 1.6896 1.0511 0.1577 3.1262 1.3393 0.5012 63.4367 9.3458 0.8150 13.6968 13.3377 20.3325 11.3096 14.1911 0.0264 1.2469 8.0952 123.9050 6.5133 9.3004 3.3092 23.0292 0.8825 36.1123 59.1424 0.6650 10.5949 166.9924 19.7632 219.8891 17.1057 68.3272 11.5332 59.8228 31.3791 9.8230 15.8854 4.6907 2.9899 5.3351 51.4049 18.8201 1.5266 12.4437 6.4810 1.7722 0.5042 0.1883 4.7122 5.8873 4.4195 1.2959 151.7468 8.1449 80.5433 55.5066 12.6154 18.8989 4.4707 10.8494 1.5626 440.9445 32.1957 9.9411 4.5552 13.3096 12.6482 83.0289 3.1158 0.4021 11.9545 29.2711 3.1518 28.5790 40.8668 3.4318 9.6988 7.6967 5.3596 15.5267 16.3795 312.4429 9.7879 92.3428 1.9764 1.3125 126.9364 84.4627 275.8510 63.3874 35.8302 10.8444 45.8145 39.1013 17.3459 4.0406 48.9371 5.2889 7.4340 0.4776 8.9589 18.5844 7.4582 382.1439 1.2186 103.0475 1.9350 59.2974
temp: 298.150 k
press: 1.00000 atm
elementType: 8 8 8 8 7 7 7 7 7 6 6 6 6 6 6 6 6 6 6 6 6 6 1 1 1 1 1 1 1 1 1 1 1 1 1 1 1 1 1 1 1
symmnumber: 1
zpe: 851896.0 jmol-1
zpe.correction: 0.324470 hartree
zpe.thermalcorrener: 0.347008 hartree
zpe.thermalcorrenthalpy: 0.347953 hartree
zpe.thermalcorrgfe: 0.269162 hartree
zpe.sumelectzpe: -1079.669444 hartree
zpe.sumelectthermal: -1079.646906 hartree
zpe.sumelectthermalent: -1079.645962 hartree
zpe.sumelectthermalfe: -1079.724752 hartree
dipole: 1.9047 -1.9315 0.2773
dipole: 2.7268
quadrupole: -146.5617 -117.6173 -126.2055
quadrupole: 10.3712 -7.8268 -4.5831
quadrupole: -16.4335 12.5109 3.9227 10.3712 -7.8268 -4.5831
hfenergy: -1079.9939143 hartree
pointgroup: C01 [X(C13H19N5O4)]
dipole: 0.4058353 -0.9913241 -0.0589666 debye
polarizability: 177.65981|9.4628826|256.8930976|-4.3490131|9.0148306|147.9425006 unknown
InChI: InChI=1S/C13H19N5O4/c14-11(7-4-8-16-13(15)17-18(20)21)12(19)22-9-10-5-2-1-3-6-10/h1-3,5-6,11,17H,4,7-9,14-15H2
charge 0 multiplicity 1
41 atoms
O  -2.001003 -2.106136 1.028901
O  -1.589499 -3.063612 -1.063398
O  3.098922 4.099569 0.69034
O  0.832263 4.470082 0.643486
N  0.312619 -4.861709 0.241308
N  1.924142 0.129097 -0.065315
N  1.61118 2.356192 0.309283
N  3.881645 1.554804 0.201555
N  1.867234 3.702301 0.559177
C  1.067192 -2.58254 0.95197
C  -0.107577 -3.602673 0.870684
C  1.759411 -2.304434 -0.399412
C  2.712837 -1.096356 -0.304126
C  -1.295429 -2.926063 0.148289
C  -3.114272 -1.268801 0.4410
C  -2.590735 0.06039 -0.05502
C  -2.422321 1.144867 0.843514
C  -2.256947 0.2366 -1.422426
C  2.533493 1.265877 0.140024
C  -1.922286 2.385164 0.387272
C  -1.764794 1.477508 -1.883655
C  -1.596138 2.554884 -0.981617
H  0.684687 -1.629399 1.362392
H  1.806207 -2.994544 1.665615
H  -0.433608 -3.812613 1.905012
H  1.008817 -2.081801 -1.181298
H  2.333256 -3.195239 -0.72067
H  3.292056 -1.007675 -1.251587
H  3.452768 -1.275504 0.513491
H  -0.328336 -5.641827 0.421701
H  0.483403 -4.760085 -0.765995
H  -3.802308 -1.153255 1.292953
H  -3.586367 -1.852867 -0.367479
H  -2.678017 1.013954 1.902071
H  -2.370123 -0.606856 -2.112796
H  -1.795677 3.222246 1.082119
H  -1.511069 1.604869 -2.941724
H  -1.220629 3.522156 -1.333605
H  0.612031 2.12115 0.206965
H  4.551872 0.800212 0.087839
H  4.184097 2.513866 0.393062
