program: Gaussian 09
title: 000151474
version: EM64L-G09RevD.01
frameworkgroup: C1[X(C6H12O5)]
method: RPBEPBE
basis: SDD
operation: Freq
keyword: #pfreq=noraman
keyword: PBEPBE/SDD
title: #p freq=noraman PBEPBE/SDD
converged: YES YES NO NO
title: Mulliken charges:
elementType: O O O O O C C C C C C H H H H H H H H H H H H
charge: -0.480762 -0.478748 -0.462905 -0.469290 -0.217593 -0.132981 -0.084721 -0.074108 -0.139976 -0.707701 -0.083175 0.255374 0.211162 0.234107 0.222873 0.240790 0.216653 0.240010 0.354697 0.374865 0.238825 0.374461 0.368143
chargesum: 0.00000
title: Mulliken charges with hydrogens summed into heavy atoms:
elementType: O O O O O C C C C C C
charge: -0.126064 -0.103883 -0.088444 -0.101147 -0.217593 0.122393 0.126441 0.159999 0.082897 -0.010248 0.155649
polarizability: 1.03333839e+02 -1.88825389e-02 7.58211657e+01 1.32749799e+00 -1.89793085e+00 6.79190545e+01
1716.lowfreq: -14.8635 -10.7567 -7.4504 -0.0010 -0.0008 -0.0007 35.6008 64.0308 92.5723
frequency: 35.4146 64.0149 92.5692 129.6161 166.1223 197.5173 231.2516 234.6912 266.4170 274.7450 290.6935 322.9434 330.9487 407.8157 422.2333 455.2668 499.2330 520.7531 597.0305 695.2766 733.8792 786.0129 802.2818 831.0776 855.8769 930.0416 950.0468 968.5533 1022.6474 1045.2860 1061.9986 1084.4542 1102.8565 1107.4400 1154.7427 1209.4515 1246.2478 1254.7689 1273.4686 1306.0708 1311.9522 1319.4681 1345.0572 1366.5728 1369.8894 1381.3845 1392.7401 1445.8974 1467.3350 1478.2389 1605.6224 2940.7684 2958.2342 2991.2096 3016.8223 3025.2507 3048.4072 3088.9594 3105.6035 3193.5121 3391.1218 3500.4874 3595.8623
redmass: 5.1536 7.2927 3.9212 4.8151 4.3696 3.6252 1.3095 1.2363 2.3829 3.4686 4.3378 4.7933 4.9015 3.0909 3.6283 2.8991 1.2924 1.2480 3.2678 3.2913 4.6871 1.8338 1.8202 2.4696 3.1355 2.2346 2.7949 2.2715 1.8947 3.5576 3.0064 2.4779 2.3595 1.7895 1.2373 1.4031 1.2288 1.3573 1.3502 1.1237 1.2629 1.1990 1.2802 1.3126 1.2607 1.5110 1.2947 1.2598 1.0499 1.0534 7.8479 1.0800 1.0864 1.0361 1.0908 1.0851 1.0868 1.0983 1.1009 1.0688 1.0643 1.0642 1.0666
irintensity: 0.9017 1.6203 7.7434 0.0748 7.9190 14.7116 47.4826 53.1154 33.6664 10.3731 55.6143 3.3530 16.6069 14.1231 2.8514 14.6160 132.0057 120.9323 13.4190 7.2370 25.1438 100.3791 44.3131 42.9199 11.4342 64.3516 54.3281 37.9247 86.1048 35.2928 9.9654 38.3708 17.4144 81.2674 45.0582 29.4067 14.4974 11.7120 30.7895 7.8354 12.9733 62.0405 4.3460 88.9358 2.1389 37.7926 12.6228 103.9102 15.3217 7.7934 138.8587 0.7897 90.5750 15.2885 29.4163 10.4780 13.1334 22.7391 19.7642 421.4437 41.4486 23.6719 12.4064
temp: 298.150 k
press: 1.00000 atm
elementType: 8 8 8 8 8 6 6 6 6 6 6 1 1 1 1 1 1 1 1 1 1 1 1
symmnumber: 1
zpe: 480313.5 jmol-1
zpe.correction: 0.182942 hartree
zpe.thermalcorrener: 0.195627 hartree
zpe.thermalcorrenthalpy: 0.196571 hartree
zpe.thermalcorrgfe: 0.144029 hartree
zpe.sumelectzpe: -611.013641 hartree
zpe.sumelectthermal: -611.000955 hartree
zpe.sumelectthermalent: -611.000011 hartree
zpe.sumelectthermalfe: -611.052554 hartree
dipole: -2.1198 -1.1022 0.7174
dipole: 2.4946
quadrupole: -76.1768 -71.6604 -59.9110
quadrupole: 2.1961 -1.9521 1.3041
quadrupole: -6.9274 -2.4110 9.3384 2.1961 -1.9521 1.3041
hfenergy: -611.1965824 hartree
pointgroup: C01 [X(C6H12O5)]
dipole: 0.875355 -0.2822826 -0.342565 debye
dipolederiv: -0.6246467 -0.0255575 0.2711802 -0.0222917 -0.5588801 0.0964247 0.335172 0.109626 -0.5948392 -0.6828635 -0.0765976 -0.0720926 -0.1808101 -0.7327257 -0.1098844 -0.1434415 -0.1150353 -0.5881565 -0.7884654 -0.011454 -0.2436943 0.1114412 -0.7698093 -0.0504472 -0.2304271 -0.0802741 -0.3459837 -0.3743794 -0.0677773 0.0182625 -0.1617568 -0.7091873 -0.0899936 -0.0107015 -0.085341 -0.5467845 -1.0091254 -0.0266423 -0.021795 -0.1433405 -0.4274861 -0.0876532 -0.2573329 -0.0919026 -0.3552571 0.3747102 0.0895612 -0.1881262 -0.0139863 0.1972021 -0.1174241 -0.2630898 -0.1700737 0.3595888 0.3219555 0.1029398 0.1205645 0.4534312 0.432782 0.1083635 0.0239564 0.1470353 0.436044 0.3498538 0.0298581 0.0609955 -0.0880724 0.6268251 -0.0040522 0.1077646 0.0270269 0.2421662 -0.4428171 0.1366842 0.1169225 0.2336329 0.3331005 0.0525877 0.1683313 0.1458406 0.3757269 -0.1172609 0.1088451 -0.0002163 0.0732944 -0.0834752 -0.0280503 -0.0399045 -0.012411 0.0305739 1.2795426 0.0002802 0.0872455 -0.1760395 0.368393 0.2062895 0.2029302 0.1854029 0.199258 0.0808031 -0.0142042 0.0264688 -0.018371 -0.079723 -0.0096447 0.0120008 -0.055642 0.0106194 -0.0251453 -0.0018333 -0.0578841 0.0001326 0.0013329 0.0441451 -0.0322194 0.0253287 -0.2012664 -0.0061853 -0.040252 0.0975982 -0.0256756 0.0193088 0.0115701 0.122348 0.0300661 -0.0322692 0.0808756 0.0029063 -0.085681 0.0234169 0.0173956 0.0138186 -0.0601076 -0.017687 -0.1294637 -0.0137611 0.0287081 -0.0995818 0.0051117 0.0993975 -0.0191142 -0.1261172 0.0008979 -0.0576555 0.0620029 -0.0779396 -0.0051305 -0.0388475 -0.1213444 -0.0224826 -0.0019346 -0.0352056 0.1037217 0.0375473 -0.0045372 0.0752499 -0.0503187 0.0752775 0.0564404 0.1200987 0.0325508 -0.0172531 0.2210823 -0.0022894 -0.2109988 -0.0375147 0.3303537 0.0284136 -0.1736467 0.0303043 0.2006737 0.6360792 -0.0752659 0.0668448 -0.0640608 0.3364262 0.0011872 0.0990854 0.007197 0.3205242 0.0849981 0.0175478 -0.0096086 0.0459599 -0.0457074 -0.1166062 -0.0136532 -0.1190263 0.0484977 0.3658459 0.0115005 0.1306691 0.0392398 0.3048518 0.0108597 0.1561301 0.0329228 0.2082863 0.1893535 -0.1044809 -0.0771923 0.0354249 0.3856919 0.0252525 0.0047584 0.0083995 0.3332481 unknown
polarizability: 103.0279086|1.3600448|74.2807761|2.9299443|3.87293|69.7653742 unknown
InChI: InChI=1S/C6H12O5/c1-3(8)5(10)6(11)4(9)2-7/h2-6,8-11H,1H3
charge 0 multiplicity 1
23 atoms
O  1.912157 0.598669 -1.641597
O  -0.276258 1.709933 0.374663
O  2.300462 1.167855 0.933196
O  -1.481241 -1.622194 -0.764197
O  -3.745594 -0.273043 -0.264828
C  1.046749 -0.15596 -0.706809
C  -0.319752 0.550937 -0.507689
C  1.895288 -0.226874 0.586528
C  -1.361083 -0.451886 0.084717
C  3.119095 -1.140181 0.458147
C  -2.713636 0.229318 0.254688
H  0.847818 -1.171751 -1.098595
H  -0.69482 0.872351 -1.504285
H  1.265141 -0.542543 1.436206
H  -1.010579 -0.747196 1.098703
H  3.74054 -1.065879 1.366428
H  2.805577 -2.193106 0.334774
H  3.726796 -0.856824 -0.418931
H  1.43045 0.761419 -2.489349
H  0.664438 1.803603 0.731644
H  -2.726878 1.173854 0.835162
H  2.779554 1.51457 0.131472
H  -2.453323 -1.718272 -0.984548
