program: Gaussian 09
title: 000151473
version: EM64L-G09RevD.01
frameworkgroup: C1[X(C9H10FNO3)]
method: RPBEPBE
basis: SDD
operation: Freq
keyword: #p
keyword: freq=noraman
keyword: PBEPBE/SDD
title: #p freq=noraman PBEPBE/SDD
converged: YES YES NO NO
title: Mulliken charges:
elementType: F O O O N C C C C C C C C C H H H H H H H H H H
charge: -0.204772 -0.413323 -0.429207 -0.251344 -0.554265 -0.547676 -0.207422 0.312651 0.197470 -0.328843 0.184793 -0.533377 -0.373998 0.318131 0.257232 0.223603 0.282685 0.262951 0.280218 0.288808 0.248859 0.255079 0.373972 0.357776
chargesum: 0.00000
title: Mulliken charges with hydrogens summed into heavy atoms:
elementType: F O O O N C C C C C C C C C
charge: -0.204772 -0.039351 -0.071432 -0.251344 0.014761 -0.066840 0.075263 0.312651 0.197470 -0.065892 0.184793 -0.284518 -0.118920 0.318131
polarizability: 1.39564412e+02 1.35000245e+01 1.10348539e+02 -1.51240254e+01 9.94947129e+00 8.63627041e+01
1716.lowfreq: -8.2873 -1.3035 -0.0005 -0.0004 0.0005 3.9857 24.8677 32.0342 52.9457
frequency: 24.3793 32.0301 52.9372 70.9554 131.6362 210.3948 222.2616 239.3732 260.7356 292.5974 303.3007 323.2082 346.8437 357.8487 441.5261 472.4448 475.2774 520.2978 538.1126 582.1615 586.3647 611.3930 628.8563 702.8978 707.1534 721.3226 780.5382 791.9046 821.3596 836.0777 930.1461 953.9131 955.3016 993.7793 1046.0624 1075.3056 1098.5323 1119.4152 1141.0183 1158.8250 1195.5037 1215.7275 1244.7503 1268.0379 1299.0093 1321.4167 1342.7213 1369.4611 1394.7373 1427.4787 1462.9314 1504.0793 1591.7960 1634.9404 1639.4555 1647.2204 3013.7034 3070.1724 3086.7390 3147.9356 3151.3810 3180.0108 3458.7684 3495.4432 3585.7499 3592.2047
redmass: 6.3770 7.6730 8.4567 4.6728 6.4119 5.2265 6.7637 3.0467 2.7900 2.4659 2.4582 2.5199 1.1202 5.2361 3.1790 3.7426 4.2357 5.0197 5.4433 2.3035 1.6313 3.8485 1.4568 3.3112 3.8349 6.6525 3.3576 2.9987 1.7789 1.5982 3.3186 2.0549 1.3862 2.8623 2.1877 2.2729 3.2069 1.7744 1.2548 1.2247 1.7209 1.6080 1.6061 2.1507 2.0232 1.4559 1.6526 1.3476 4.8755 3.3476 1.1455 3.1817 6.6539 1.1237 7.5080 6.8320 1.0607 1.0893 1.0988 1.0901 1.0926 1.0958 1.0446 1.0638 1.0662 1.0987
irintensity: 0.7277 1.5290 1.4965 0.8625 0.2346 1.8042 0.5439 9.0462 10.8756 5.3182 22.2574 26.7174 142.9026 4.5198 0.9149 34.0887 22.9990 36.3732 5.7694 55.1499 202.6136 6.6863 132.7354 6.3475 37.7707 3.1637 5.2213 3.7676 9.4489 66.0495 22.3672 23.8093 4.2789 60.1970 210.4462 48.2790 64.0972 141.7112 55.2835 21.5476 9.3573 16.0858 5.7412 23.4587 11.4406 10.8219 8.2739 9.5367 16.0256 11.7252 19.1033 106.8386 44.8379 57.7538 78.6620 167.9700 16.6561 3.3060 9.1434 5.1405 1.8315 3.5245 4.0157 16.3084 44.2590 5.5121
temp: 298.150 k
press: 1.00000 atm
elementType: 9 8 8 8 7 6 6 6 6 6 6 6 6 6 1 1 1 1 1 1 1 1 1 1
symmnumber: 1
zpe: 471926.0 jmol-1
zpe.correction: 0.179747 hartree
zpe.thermalcorrener: 0.193529 hartree
zpe.thermalcorrenthalpy: 0.194473 hartree
zpe.thermalcorrgfe: 0.137743 hartree
zpe.sumelectzpe: -728.180916 hartree
zpe.sumelectthermal: -728.167134 hartree
zpe.sumelectthermalent: -728.166190 hartree
zpe.sumelectthermalfe: -728.222919 hartree
dipole: 0.1870 -0.0902 1.4588
dipole: 1.4735
quadrupole: -65.4866 -86.9440 -78.3158
quadrupole: -5.9498 -2.7358 -1.6839
quadrupole: 11.4289 -10.0286 -1.4004 -5.9498 -2.7358 -1.6839
hfenergy: -728.3606626 hartree
pointgroup: C01 [X(C9H10F1N1O3)]
dipole: -0.038379 0.0558565 0.5757293 debye
dipolederiv: -0.3180058 -0.1680555 0.0373939 -0.2050668 -0.8353929 0.2407448 0.0554071 0.2686634 -0.2492625 -0.3909368 -0.0057071 0.0838143 0.0318432 -0.2694376 -0.2597604 0.1159684 -0.2088786 -1.1903769 -1.4117845 -0.3421495 -0.1453947 -0.3733226 -0.2584217 -0.205012 -0.1982212 -0.2143512 -0.3811757 -0.3782777 0.1613871 -0.0499194 0.0355627 -0.7919227 0.2537686 0.1464241 0.0867278 -0.7513024 -0.6260576 -0.079673 0.0143778 -0.1644392 -0.8339104 -0.1983676 0.053389 -0.2096795 -0.2331192 0.0335879 -0.0326736 0.0416036 -0.0123188 0.0439679 -0.0313298 0.1417183 0.0183563 0.1129734 0.5297858 0.0042105 -0.0282787 0.0405901 0.2368929 0.0265608 -0.1378127 0.0187783 0.1097068 0.0518573 0.1202419 -0.0255297 0.0467619 -0.2601567 0.0655942 0.092232 0.1148116 -0.1854008 0.4813791 0.0733611 0.0822044 0.2199962 0.8900654 -0.278318 0.0139888 -0.3614181 0.26302 0.1451717 0.115101 0.041967 0.0495748 0.1372717 -0.0990324 0.0538709 -0.0667441 -0.0673575 0.1430757 -0.138905 -0.0196522 -0.1955321 0.9504276 0.0078751 -0.213632 0.1068692 1.4932944 -0.406884 -0.1009673 0.0031001 -0.2663927 -0.2584092 -0.0682867 0.0647282 -0.0178975 -0.1769085 -0.4089956 -0.087607 -0.013103 0.1705741 0.0104102 -0.0439987 -0.1590621 -0.12476 -0.1687168 1.3488687 0.3579238 0.2590689 0.3344199 0.2556835 0.0335569 0.3187991 0.0518886 0.1739327 0.025952 -0.0008116 -0.0004184 -0.0171833 -0.0531137 -0.0618899 0.0004867 -0.0389969 0.0725883 -0.0045637 -0.0040606 -0.0575649 0.033216 0.0512085 0.1120455 -0.0580243 0.0414736 -0.0297867 0.0512926 0.0156982 -0.0463004 0.0030532 0.0289537 0.040192 -0.0696402 0.0337139 -0.0285111 0.0481825 0.0540522 -0.0842407 0.0463962 0.0603807 0.0450141 -0.0790256 0.0479836 0.1002733 0.1616565 -0.0027409 -0.0297095 0.0452938 0.2268504 0.1753148 -0.0450631 0.1209223 0.1699843 0.0561753 -0.0223759 0.0507328 0.0736159 0.3654202 -0.0368551 0.053135 0.0012713 0.080199 0.0055497 0.035982 -0.0843063 0.0256956 0.0759332 0.0698217 -0.0883445 0.075096 0.1281009 0.0790448 -0.0566778 -0.0047194 -0.0679032 -0.0045263 0.0695185 -0.0079177 0.066934 0.1401087 0.3851284 0.0599474 0.0010761 0.0684897 0.0812441 -0.001781 -0.0198364 0.0559712 0.3135629 0.3987976 0.0444996 -0.0262017 0.0770756 0.150581 0.1446245 -0.0335677 0.1332647 0.3041733 unknown
polarizability: 139.7010822|15.0002379|111.1068649|11.6004305|-11.146485|85.4677085 unknown
InChI: InChI=1S/C9H10FNO3/c10-7-4-6(12)2-1-5(7)3-8(11)9(13)14/h1-2,4,8,12-13H,3,11H2
charge 0 multiplicity 1
24 atoms
F  0.765112 -2.424424 0.575632
O  -2.374783 0.996633 1.966835
O  4.186074 1.033659 0.188139
O  -2.4792 1.692177 -0.24888
N  -3.425165 -1.33492 -0.048729
C  -1.147079 -0.898229 -0.932411
C  -2.119107 -0.721441 0.262734
C  0.254017 -0.39117 -0.644653
C  1.175412 -1.154516 0.100784
C  0.718667 0.875983 -1.087321
C  -2.309018 0.771065 0.584328
C  2.482479 -0.746349 0.408946
C  2.019813 1.336998 -0.806366
C  2.90184 0.5227 -0.058079
H  -1.139086 -1.977207 -1.163318
H  -1.562485 -0.360453 -1.804761
H  -1.706526 -1.22274 1.153009
H  0.032996 1.511225 -1.658201
H  -3.909228 -0.907969 -0.845665
H  -4.036686 -1.476928 0.760258
H  3.136676 -1.405057 0.990756
H  2.366912 2.313553 -1.153912
H  -2.559015 1.961069 2.137947
H  4.73168 0.396142 0.711829
