program: Gaussian 09
title: 000151470
version: EM64L-G09RevD.01
frameworkgroup: C1[X(C12H18N2O2)]
method: RPBEPBE
basis: SDD
operation: Freq
keyword: #p
keyword: freq=noraman
keyword: PBEPBE/SDD
title: #p freq=noraman PBEPBE/SDD
converged: YES YES NO NO
title: Mulliken charges:
elementType: O O N N C C C C C C C C C C C C H H H H H H H H H H H H H H H H H H
charge: -0.203299 -0.211185 -0.360139 -0.100679 -0.174594 -0.537960 -0.510062 0.143463 0.182089 -0.410688 -0.307333 -0.311409 -0.020206 -0.018256 -0.691848 -0.682109 0.265943 0.264637 0.273661 0.241108 0.268766 0.352113 0.179616 0.210562 0.177203 0.212055 0.232805 0.213105 0.205406 0.202044 0.262834 0.211542 0.207083 0.233731
chargesum: 0.00000
title: Mulliken charges with hydrogens summed into heavy atoms:
elementType: O O N N C C C C C C C C C C C C
charge: -0.203299 -0.211185 -0.008026 -0.100679 0.091350 0.000339 -0.000188 0.143463 0.182089 0.035222 0.082845 0.077848 -0.020206 -0.018256 -0.021563 -0.029754
polarizability: 1.63832416e+02 1.43684283e+01 1.43359271e+02 8.99681667e+00 -4.50007639e+00 1.25528079e+02
1716.lowfreq: -14.8589 -8.8310 -5.2718 -0.0008 0.0004 0.0006 15.0765 18.2917 33.4653
frequency: 14.6535 17.2078 33.2447 49.7621 52.2213 67.7415 93.4054 135.5391 155.9393 180.2770 192.1318 212.3911 245.4090 260.0733 281.2146 296.5711 336.8907 355.8992 367.9425 389.1576 443.6473 480.7851 522.8281 524.9225 567.6071 586.3688 611.9339 708.3294 734.0302 743.1844 755.9669 795.6532 801.9978 813.3307 872.0363 890.6753 904.2118 956.0489 972.3792 987.5026 1013.0080 1055.7206 1073.3214 1073.9989 1087.0036 1112.6367 1151.9997 1163.0770 1165.9911 1174.8995 1193.5904 1198.2564 1235.0728 1242.7726 1251.7003 1276.3289 1283.8442 1288.6169 1300.9349 1326.1219 1342.0417 1351.4861 1360.2555 1371.2404 1388.7527 1396.0050 1434.0524 1454.0876 1455.4801 1465.4125 1470.1473 1473.3141 1477.7125 1487.7456 1491.2545 1663.6615 1703.3499 2282.0571 2821.6446 2836.3281 2850.3233 2984.1893 2984.6545 2985.1961 3021.2580 3022.5840 3029.3220 3029.9249 3037.9919 3043.9159 3072.3970 3076.4455 3087.2150 3094.7633 3096.8189 3551.1303
redmass: 4.2171 4.4772 6.2177 3.8307 4.0557 2.0209 2.1049 2.1786 8.3703 4.4986 1.4623 1.3949 2.6022 2.0775 2.0737 2.6292 3.2761 3.6428 7.6451 3.5647 2.8953 2.7854 2.7555 3.7126 5.9779 5.9142 9.7320 2.2930 3.0591 3.8896 1.7201 1.2303 1.1992 2.4688 3.3798 2.2248 1.9159 2.5522 2.3066 1.7625 2.3542 2.5158 2.1654 1.9523 2.1375 1.8640 1.8277 1.4854 2.0090 2.3767 2.2182 1.4079 1.3759 1.2831 2.1398 1.1532 1.2057 2.0089 2.0333 1.7438 1.5089 1.4083 1.3217 1.4063 1.2211 1.2194 1.0867 1.0862 1.0795 1.0536 1.0492 1.0646 1.0510 1.0619 1.0699 7.6148 12.4561 11.7192 1.0716 1.0723 1.0707 1.0367 1.0363 1.0589 1.0866 1.0734 1.0834 1.0727 1.1013 1.0877 1.0983 1.0972 1.1017 1.1002 1.1004 1.0791
irintensity: 0.2529 0.4972 0.4143 0.5958 0.2682 0.7830 0.4390 0.5909 15.7956 1.6345 2.4213 1.3735 1.6414 6.0639 3.3505 2.2881 1.4054 3.1800 23.8423 1.1315 1.5365 5.2647 4.0173 6.1090 14.1744 11.6845 5.8024 17.9201 23.0342 9.9494 107.2972 6.9644 3.7974 10.4783 6.0690 4.7937 1.5882 6.5326 15.6387 3.4614 6.8235 20.0453 10.7057 12.4529 1.9605 21.0870 25.2206 14.2546 29.8464 92.6619 33.8718 46.4655 10.5779 12.2379 38.0720 10.6969 17.2547 48.2937 25.8400 16.1098 18.2133 15.1988 8.8549 4.0878 22.0633 20.8927 17.4740 11.6179 6.2048 4.5335 14.1562 2.4280 7.8547 14.0739 10.2008 621.5556 41.2177 0.6673 53.2979 41.8089 241.6736 35.7794 29.5063 20.6867 13.1271 17.8244 13.2989 10.4499 6.3103 7.6770 34.9655 81.9256 4.9181 31.3907 27.6676 47.2555
temp: 298.150 k
press: 1.00000 atm
elementType: 8 8 7 7 6 6 6 6 6 6 6 6 6 6 6 6 1 1 1 1 1 1 1 1 1 1 1 1 1 1 1 1 1 1
symmnumber: 1
zpe: 740333.9 jmol-1
zpe.correction: 0.281978 hartree
zpe.thermalcorrener: 0.299776 hartree
zpe.thermalcorrenthalpy: 0.300721 hartree
zpe.thermalcorrgfe: 0.232849 hartree
zpe.sumelectzpe: -726.746199 hartree
zpe.sumelectthermal: -726.728400 hartree
zpe.sumelectthermalent: -726.727456 hartree
zpe.sumelectthermalfe: -726.795328 hartree
dipole: 0.5500 -0.5014 -2.4856
dipole: 2.5947
quadrupole: -86.4822 -108.0782 -92.9739
quadrupole: -6.3132 8.7441 2.2149
quadrupole: 9.3626 -12.2334 2.8708 -6.3132 8.7441 2.2149
hfenergy: -727.0281768 hartree
pointgroup: C01[X(C12H18N2O2)]
dipole: 0.1846323 0.1424328 0.9938262 debye
polarizability: 163.9328996|-14.1301507|144.3098818|-8.4394027|-3.8667411|124.4769842 unknown
InChI: InChI=1S/C12H18N2O2/c1-3-14(4-2)8-6-5-7-10-9-11(15)13-12(10)16/h10,13H,3-4,7-9H2,1-2H3
charge 0 multiplicity 1
34 atoms
O  -2.988472 1.50336 -1.659448
O  -1.052617 -2.685684 -0.809505
N  -1.982981 -0.633116 -1.520715
N  2.535195 0.135807 0.18121
C  -2.739857 0.308042 0.530702
C  -2.108322 -1.081294 0.802833
C  -2.077122 1.500866 1.292036
C  -2.612919 0.511256 -0.994515
C  -1.635804 -1.607085 -0.558674
C  2.055974 1.467049 0.654411
C  2.417889 -0.902985 1.245064
C  3.909742 0.229081 -0.383674
C  -0.613829 1.531384 1.117697
C  0.603049 1.492985 0.914935
C  2.41444 -2.340151 0.691907
C  3.957839 0.912452 -1.763854
H  -3.818463 0.319398 0.775002
H  -2.815733 -1.805072 1.242041
H  -1.233086 -1.0205 1.472451
H  -2.337422 1.427048 2.365687
H  -2.525019 2.438716 0.910789
H  -1.755033 -0.733374 -2.513079
H  3.227422 -0.786928 2.012059
H  1.459784 -0.724098 1.768048
H  4.607101 0.750005 0.32399
H  4.288548 -0.802078 -0.493903
H  2.282601 2.213031 -0.12938
H  2.59922 1.800698 1.578114
H  2.30191 -3.064206 1.520553
H  3.352939 -2.588018 0.163594
H  1.574744 -2.481508 -0.009701
H  4.984679 0.875253 -2.172587
H  3.65971 1.975822 -1.721509
H  3.279694 0.395043 -2.464076
