program: Gaussian 09
title: 000151469
version: EM64L-G09RevD.01
frameworkgroup: C1[X(C17H14O2)]
method: RPBEPBE
basis: SDD
operation: Freq
keyword: #pfreq=noraman
keyword: PBEPBE/SDD
title: #p freq=noraman PBEPBE/SDD
converged: YES YES NO NO
title: Mulliken charges:
elementType: O O C C C C C C C C C C C C C C C C C H H H H H H H H H H H H H H
charge: -0.144913 -0.168012 -0.454768 0.396649 -0.081023 -0.009102 0.260530 0.216842 0.300640 -0.365904 -0.577716 -0.373315 -0.366733 0.463267 -0.425979 -0.861961 -0.209055 -0.207974 -0.812907 0.278198 0.225507 0.233227 0.280722 0.279210 0.230089 0.223014 0.231790 0.272260 0.241586 0.241285 0.225061 0.224196 0.235290
chargesum: 0.00000
title: Mulliken charges with hydrogens summed into heavy atoms:
elementType: O O C C C C C C C C C C C C C C C C C
charge: -0.144913 -0.168012 -0.176570 0.396649 -0.081023 -0.009102 0.260530 0.216842 0.300640 -0.140396 -0.344490 -0.092593 -0.087523 0.463267 -0.195891 -0.134898 0.032531 0.033311 -0.128360
polarizability: 2.62710169e+02 1.27693838e+01 1.70298316e+02 1.01005387e+01 -4.68828269e+00 1.32381109e+02
1716.lowfreq: -17.5799 -9.8843 -4.4728 -0.0007 0.0003 0.0006 6.3026 17.2599 43.7337
frequency: -17.0868 16.9069 43.6787 56.2491 118.7974 127.5656 146.8056 171.1336 176.5685 205.6728 210.1816 237.2946 282.1816 325.1393 333.5751 386.0953 433.8722 438.0241 447.9741 468.1108 519.7434 523.6273 545.6839 550.7400 563.7130 605.7606 657.4145 682.4865 716.3650 731.7937 762.9828 770.8470 781.6885 808.6003 845.1731 860.9203 887.3316 911.5980 927.8911 950.5953 976.5562 983.9169 985.9456 1006.8003 1013.5695 1020.3536 1045.9981 1051.6643 1058.8281 1080.5638 1111.1506 1169.3877 1170.2647 1175.2430 1190.8099 1200.7023 1225.6729 1251.1339 1266.2615 1279.2381 1298.0971 1370.5273 1395.2886 1397.4674 1405.3397 1408.0447 1451.4964 1453.2377 1471.0686 1473.1781 1474.5941 1483.3484 1503.1649 1584.0730 1589.3089 1599.3623 1622.3396 1628.1134 1653.9069 2967.9379 2974.8966 2988.3359 3051.8824 3055.9974 3084.8502 3087.1969 3114.7782 3118.9760 3138.0926 3143.0910 3151.8238 3163.3591 3172.9405
redmass: 1.0156 6.0087 4.2436 4.9618 4.7867 6.8393 5.0275 1.3237 3.5130 2.1387 4.8023 6.8907 2.6491 6.7300 5.7629 3.8403 3.9646 2.9656 3.1453 4.0894 8.2741 7.6203 5.3031 3.6353 4.8282 3.6807 5.9502 5.1189 5.2583 3.7557 2.2210 3.4473 2.2578 1.5434 3.8031 3.4003 1.2975 1.4640 3.3134 1.4478 4.6588 1.5319 1.4256 2.5334 1.3625 1.4959 1.5636 1.5750 3.3642 2.4423 1.9367 1.3190 1.3100 1.5699 1.6750 1.3548 2.3409 4.1542 3.4589 1.6317 1.3855 6.0773 1.2802 1.2283 2.8271 7.8437 2.5197 2.5481 1.0922 1.0547 1.1048 1.2827 1.9846 6.4772 7.4925 7.7446 6.5422 9.9495 12.3793 1.0409 1.0386 1.0789 1.0939 1.0950 1.0997 1.0989 1.0910 1.0871 1.0864 1.0969 1.0901 1.0956 1.1004
irintensity: 0.3876 3.5840 0.4316 1.2983 0.5494 3.3103 1.1085 1.7953 0.6124 2.4785 1.0327 0.1570 0.5708 4.9663 5.3587 0.0886 1.8398 2.4021 3.4322 7.6541 1.4248 0.8330 1.4603 4.1267 26.9918 1.1905 15.8076 2.4393 1.7771 2.5194 48.1063 7.8864 33.8505 27.5394 3.1917 6.0848 3.8454 0.0262 4.1191 1.5006 8.7469 2.1439 2.4903 5.2455 0.0265 3.9927 9.5851 15.0813 15.3911 1.1951 7.8600 21.8317 2.6400 6.2656 6.9854 2.3334 5.6789 332.8430 16.2484 4.4649 4.0323 2.8584 21.3751 9.1098 0.5327 10.9383 0.6101 0.5210 3.4387 14.7433 17.5181 27.0307 45.8257 21.1614 136.6921 1.2460 15.8439 142.5039 66.2475 30.2308 39.6300 10.0371 13.0739 23.6137 16.5514 21.0871 27.6764 17.2613 1.8033 15.9826 4.2506 4.9085 26.9477
temp: 298.150 k
press: 1.00000 atm
elementType: 8 8 6 6 6 6 6 6 6 6 6 6 6 6 6 6 6 6 6 1 1 1 1 1 1 1 1 1 1 1 1 1 1
symmnumber: 1
zpe: 675716.4 jmol-1
zpe.correction: 0.257367 hartree
zpe.thermalcorrener: 0.273092 hartree
zpe.thermalcorrenthalpy: 0.274036 hartree
zpe.thermalcorrgfe: 0.213131 hartree
zpe.sumelectzpe: -805.352886 hartree
zpe.sumelectthermal: -805.337160 hartree
zpe.sumelectthermalent: -805.336216 hartree
zpe.sumelectthermalfe: -805.397122 hartree
dipole: -2.5692 -0.2289 -1.3794
dipole: 2.9251
quadrupole: -80.8531 -113.8254 -113.6707
quadrupole: 3.1613 3.5469 9.4598
quadrupole: 21.9300 -11.0423 -10.8877 3.1613 3.5469 9.4598
hfenergy: -805.6102524 hartree
pointgroup: C01 [X(C17H14O2)]
dipole: 1.0165746 0.0705378 -0.5347518 debye
polarizability: 262.9227908|12.3556649|170.5814987|-9.1539934|3.4591967|131.8853044 unknown
InChI: InChI=1S/C17H14O2/c1-10-7-8-12(11(2)9-10)15-16(18)13-5-3-4-6-14(13)17(15)19/h3-9,15H,1-2H3
charge 0 multiplicity 1
33 atoms
O  0.762221 1.734614 1.957027
O  0.505716 -2.359547 -0.657891
C  0.064399 -0.407744 0.85899
C  -1.321629 -0.027986 0.337753
C  1.010196 0.775273 1.183748
C  0.883847 -1.280687 -0.135824
C  2.285807 0.565643 0.433251
C  2.207688 -0.619381 -0.342116
C  -2.441701 -0.877717 0.578082
C  -1.497293 1.152003 -0.424129
C  -3.700413 -0.502599 0.048935
C  3.448117 1.365009 0.427966
C  3.288831 -1.037505 -1.14648
C  -3.885976 0.675306 -0.716917
C  -2.759838 1.503242 -0.944128
C  -2.312294 -2.162306 1.379801
C  4.532352 0.951884 -0.378594
C  4.453265 -0.236757 -1.158427
C  -5.246581 1.024036 -1.295009
H  -0.056592 -0.997882 1.790372
H  -0.643575 1.816516 -0.600738
H  -4.564462 -1.152374 0.238779
H  3.495249 2.27552 1.033553
H  3.214813 -1.955061 -1.738564
H  -2.872206 2.425619 -1.52624
H  -1.984649 -1.965926 2.420145
H  -3.279484 -2.689454 1.43557
H  -1.576953 -2.846271 0.919087
H  5.449097 1.550772 -0.408098
H  5.310219 -0.530425 -1.774383
H  -6.066487 0.679567 -0.640206
H  -5.358277 2.113073 -1.438148
H  -5.39331 0.545444 -2.283064
