program: Gaussian 09
title: 000151466
version: EM64L-G09RevD.01
frameworkgroup: C1[X(C6H12O5S)]
method: RPBEPBE
basis: SDD
operation: Freq
keyword: #p
keyword: freq=noraman
keyword: PBEPBE/SDD
title: #p freq=noraman PBEPBE/SDD
converged: YES YES NO NO
title: Mulliken charges:
elementType: S O O O O O C C C C C C H H H H H H H H H H H H
charge: 0.073727 -0.497271 -0.471016 -0.492348 -0.447634 -0.489210 -0.137197 -0.066836 -0.097613 -0.056713 -0.370578 -0.557823 0.291341 0.231471 0.248727 0.238668 0.232474 0.205296 0.376995 0.376222 0.313927 0.375612 0.355473 0.364306
chargesum: 0.00000
title: Mulliken charges with hydrogens summed into heavy atoms:
elementType: S O O O O O C C C C C C
charge: 0.073727 -0.120276 -0.094794 -0.116736 -0.092160 -0.124904 0.154144 0.164635 0.151114 0.181955 0.067191 -0.243896
polarizability: 1.20301218e+02 1.32705667e+01 9.81406985e+01 -6.52921587e+00 -5.47703263e+00 7.75111725e+01
1716.lowfreq: -6.2420 -0.0025 -0.0022 -0.0022 7.7299 12.4238 31.4023 43.3503 51.9757
frequency: 31.1300 42.8952 51.9348 85.2724 115.8838 124.9076 184.1382 237.0064 245.4642 266.4807 274.1089 289.5004 300.1503 316.9620 335.4123 368.5883 417.1492 468.8602 495.9755 510.0746 529.9944 544.0764 648.4987 703.3175 818.8350 832.4754 860.8185 903.1017 951.0043 970.4452 974.0942 1015.7346 1035.9003 1054.9218 1066.8314 1080.3441 1128.7146 1169.2304 1190.1224 1201.2926 1224.5181 1234.0506 1239.0654 1254.7226 1314.0435 1316.8231 1339.4479 1342.6885 1353.2273 1364.2148 1382.5032 1391.5591 1406.0224 1469.1955 2951.0848 2968.9247 2976.9726 2996.1907 3034.7660 3039.7056 3120.3246 3496.3006 3506.6371 3512.4768 3557.7990 3604.1217
redmass: 7.3663 6.7704 5.7663 4.2722 3.9310 5.5684 4.6859 4.7640 3.8787 3.3401 1.1616 3.7969 1.4444 3.5158 4.5968 4.1351 4.5219 1.7241 1.1812 1.5106 2.7970 1.2508 4.4075 4.0422 2.2370 2.6493 2.8769 3.1304 5.4370 6.2497 4.5481 3.3239 3.2621 2.4381 2.0422 2.3804 2.9800 1.1683 1.1269 1.3001 1.1756 1.1650 1.1320 1.1540 1.2067 1.1652 1.2478 1.2522 1.4659 1.3953 1.4843 1.8166 1.6218 1.0795 1.0815 1.0574 1.0830 1.0854 1.0892 1.1035 1.0883 1.0647 1.0648 1.0647 1.0667 1.0671
irintensity: 2.9023 0.4970 0.6703 5.0981 6.1756 2.7429 14.4990 13.7037 9.1735 34.7191 140.6577 4.2419 89.0547 40.0222 27.2484 3.8623 5.6446 19.1484 101.0682 184.2335 41.5849 147.8510 39.5596 50.3087 46.5127 53.6619 18.9408 5.6036 62.7600 84.5437 19.3951 69.6221 124.4193 54.3941 20.1210 1.2052 34.5026 34.5805 25.4371 21.5628 11.8442 70.0641 35.5876 13.3238 1.1216 44.4207 3.4538 18.6996 1.4411 30.3591 45.8572 22.5640 13.5320 6.8699 21.1703 50.6687 52.0461 16.2483 14.1137 60.5645 3.0442 52.8009 56.8800 22.2468 12.1602 12.1520
temp: 298.150 k
press: 1.00000 atm
elementType: 16 8 8 8 8 8 6 6 6 6 6 6 1 1 1 1 1 1 1 1 1 1 1 1
symmnumber: 1
zpe: 485917.3 jmol-1
zpe.correction: 0.185076 hartree
zpe.thermalcorrener: 0.199477 hartree
zpe.thermalcorrenthalpy: 0.200421 hartree
zpe.thermalcorrgfe: 0.142688 hartree
zpe.sumelectzpe: -1008.968359 hartree
zpe.sumelectthermal: -1008.953958 hartree
zpe.sumelectthermalent: -1008.953014 hartree
zpe.sumelectthermalfe: -1009.010747 hartree
dipole: -2.5603 2.7340 -0.4128
dipole: 3.7683
quadrupole: -83.0224 -78.6616 -76.1815
quadrupole: -6.1443 12.2510 -2.5034
quadrupole: -3.7339 0.6269 3.1070 -6.1443 12.2510 -2.5034
hfenergy: -1009.1534349 hartree
pointgroup: C01 [X(C6H12O5S1)]
dipole: -1.1240122 -0.9663056 0.0292714 debye
dipolederiv: -0.3449825 0.092641 -0.0965302 0.238695 -0.3627172 0.1029243 -0.112457 0.0454935 -0.1465867 -0.6917785 0.0894232 0.1607413 0.0487475 -0.7536219 -0.1204866 0.1745528 -0.1460917 -0.467123 -0.5083159 -0.1135103 -0.1304493 -0.1127638 -0.7424651 -0.0881602 -0.1435258 -0.1266058 -0.5628761 -0.8165777 0.1236389 -0.1141927 0.0981893 -0.4137017 0.0558151 -0.1403307 0.078818 -0.6253476 -0.5625367 -0.075554 -0.1157712 -0.209583 -0.3374033 0.1443528 -0.0902988 0.1923373 -0.7246511 -0.7864864 -0.1548346 -0.028467 -0.2033415 -0.652719 -0.1756485 -0.0639879 -0.1747613 -0.2573172 0.4014656 -0.117404 -0.186173 -0.0710391 0.3427089 0.070858 -0.0711546 0.0325862 0.2779919 0.3575431 0.1003382 0.0660012 0.1058767 0.5688129 0.034803 -0.1961568 0.1922503 0.3083396 0.5514127 -0.14395 0.0161372 -0.0605877 0.186991 -0.0271035 0.1021249 -0.0286012 0.3199363 0.166781 0.1292389 -0.0282076 0.2055771 0.1539654 -0.0566559 -0.1258522 -0.1384238 0.5302213 0.5415169 0.160625 0.0491438 0.1997767 0.3489361 0.1829855 0.0091914 0.1242595 0.1271262 0.4276811 -0.2314684 0.2303912 -0.3036308 0.4644965 -0.1378986 0.3300423 -0.1008436 -0.1682812 0.0625342 -0.0164431 0.0283934 -0.0469219 -0.0198765 0.0551408 0.0321523 0.0217336 -0.0522323 -0.0079085 -0.0481013 0.0334577 -0.0599241 -0.1094615 0.064114 0.0816804 0.0939047 -0.0694184 -0.0120321 0.0586766 0.03305 0.0888745 -0.033964 -0.0547217 0.0974377 -0.0636734 -0.0756366 0.0248783 -0.0601482 0.0011036 -0.1375406 -0.1156211 0.0136106 0.0044335 0.0065165 -0.0156381 -0.0073597 -0.0124511 0.0372038 -0.002835 0.029561 -0.1135591 -0.0041345 -0.0785146 -0.0923114 -0.139506 0.0618581 -0.0630557 0.1325131 -0.0422014 0.0264414 -0.0678391 -0.0012048 0.0482238 0.2267032 0.0608804 -0.0523413 0.0499428 0.4476074 0.0294426 -0.0637666 0.0442055 0.2541466 0.2751148 0.0923935 0.100548 0.065332 0.3252464 -0.0171285 0.1094146 -0.0063769 0.3530619 0.0606072 0.0051355 -0.0535297 -0.0693612 -0.0172626 0.0124225 -0.0228208 0.020831 0.1827067 0.2718714 -0.0698452 0.0102839 -0.0696892 0.2506576 -0.0632563 0.0097789 -0.0722634 0.4008035 0.1883939 0.1244393 0.1096579 0.181037 0.2141017 -0.0640085 0.1166399 -0.0715192 0.3100868 0.3209806 -0.0555783 -0.0073954 -0.067344 0.2679306 0.1257169 0.0348764 0.1559437 0.1447752 unknown
polarizability: 115.954446|-15.0011697|101.6348433|8.8040719|-6.6475948|78.3637998 unknown
InChI: InChI=1S/C6H12O5S/c7-1-3(8)5(10)6(11)4(9)2-12/h2-11H,1H2
charge 0 multiplicity 1
24 atoms
S  3.77792 -1.693389 0.683566
O  -1.335044 1.826063 0.898993
O  1.361057 1.75005 1.061525
O  -2.815481 0.587548 -0.992026
O  1.62431 0.466516 -1.653486
O  -3.090047 -1.891093 -0.083563
C  -0.646352 1.004455 -0.116703
C  0.653651 0.562717 0.581954
C  -1.584562 -0.119607 -0.591398
C  1.601304 -0.226774 -0.347719
C  -1.939932 -1.157368 0.486236
C  3.003816 -0.280464 0.222458
H  -0.389002 1.628126 -0.992783
H  0.403643 -0.090042 1.446383
H  -1.14287 -0.629025 -1.470807
H  1.21325 -1.260419 -0.464396
H  -2.222508 -0.64539 1.427777
H  -1.090797 -1.84581 0.669653
H  -2.228781 2.035231 0.515586
H  0.662421 2.362938 1.416937
H  3.494039 0.699368 0.309447
H  -3.529861 -0.10428 -1.038569
H  2.2964 0.031918 -2.238284
H  -3.469472 -2.513068 0.58342
