program: Gaussian 09
title: 000151463
version: EM64L-G09RevD.01
frameworkgroup: C1[X(C8H10O3)]
method: RPBEPBE
basis: SDD
operation: Freq
keyword: #pfreq=noraman
keyword: PBEPBE/SDD
title: #p freq=noraman PBEPBE/SDD
converged: NO NO NO NO
title: Mulliken charges:
elementType: O O O C C C C C C C C H H H H H H H H H H
charge: -0.238099 -0.401690 -0.441794 0.439616 -0.042360 0.269618 -0.576645 0.327321 -0.542501 -0.858491 -0.537180 0.254360 0.235782 0.232779 0.232797 0.252213 0.363524 0.216420 0.216417 0.248337 0.349575
chargesum: 0.00000
title: Mulliken charges with hydrogens summed into heavy atoms:
elementType: O O O C C C C C C C C
charge: -0.238099 -0.038166 -0.092219 0.439616 -0.042360 0.269618 -0.322285 0.327321 -0.306719 -0.140702 0.143995
polarizability: 1.27849514e+02 2.53995225e+00 1.18401527e+02 -2.03828216e-03 -3.15693830e-04 5.04847702e+01
1716.lowfreq: -13.7565 -0.0005 0.0003 0.0007 4.1854 6.4673 77.1306 129.8465 158.0054
frequency: 77.1072 129.8442 157.9833 186.7669 196.7785 196.8311 245.7770 273.8174 280.6572 282.6675 309.1715 361.0254 374.6112 444.7570 511.9193 522.6367 542.6547 606.2610 606.6068 721.4561 758.2494 800.4237 848.6282 893.8880 968.9713 986.3855 1043.3695 1056.7644 1112.9665 1124.0125 1157.3271 1166.9668 1180.2222 1220.1816 1266.9626 1338.8922 1393.4358 1410.5277 1437.3286 1453.6307 1460.7329 1466.3641 1473.2593 1478.8924 1510.9451 1602.6336 1643.0037 2946.6894 2953.5275 3022.0721 3029.9803 3089.5216 3120.3532 3134.2098 3163.8348 3576.3929 3588.6693
redmass: 3.0336 4.2619 1.1815 2.6669 1.5984 3.5866 1.2125 1.6607 3.0596 1.1298 5.2503 6.2014 3.9132 8.5700 5.5272 3.2910 5.1403 3.5502 3.6943 2.5627 5.4753 1.9394 1.5126 4.8809 4.1872 1.9700 1.5089 2.6436 1.2603 1.9196 1.3774 1.9508 1.4495 2.0126 1.5554 4.7883 1.3909 3.8353 1.3835 2.8348 1.3592 1.0503 1.0627 1.0438 2.0865 6.2284 7.1355 1.0340 1.0399 1.0980 1.1033 1.0946 1.0980 1.0909 1.0924 1.0654 1.0661
irintensity: 4.0041 4.8210 1.1938 0.4384 9.0721 3.1119 84.9254 55.7042 3.7857 119.7947 14.6462 0.4028 10.5108 1.5009 0.5655 0.5085 2.2659 10.9132 3.3946 11.5706 37.6198 25.1796 32.5379 2.3786 54.3976 81.2675 7.5533 52.0389 0.1547 43.1066 7.5631 367.6569 102.5273 40.7290 34.9364 50.6447 7.3485 25.2942 0.3912 85.9095 1.8194 13.2947 43.4707 14.7599 94.4695 99.3293 34.0373 71.1249 33.2922 22.8740 55.8613 12.8840 21.7654 9.8096 4.0041 32.2991 27.4021
temp: 298.150 k
press: 1.00000 atm
elementType: 8 8 8 6 6 6 6 6 6 6 6 1 1 1 1 1 1 1 1 1 1
symmnumber: 1
zpe: 430114.6 jmol-1
zpe.correction: 0.163822 hartree
zpe.thermalcorrener: 0.175318 hartree
zpe.thermalcorrenthalpy: 0.176263 hartree
zpe.thermalcorrgfe: 0.127408 hartree
zpe.sumelectzpe: -535.661711 hartree
zpe.sumelectthermal: -535.650214 hartree
zpe.sumelectthermalent: -535.649270 hartree
zpe.sumelectthermalfe: -535.698125 hartree
dipole: 0.7777 0.8693 -0.0006
dipole: 1.1664
quadrupole: -51.3991 -62.4683 -68.2526
quadrupole: 15.6731 -0.0001 -0.0002
quadrupole: 9.3076 -1.7617 -7.5459 15.6731 -0.0001 -0.0002
hfenergy: -535.8255328 hartree
pointgroup: C01 [X(C8H10O3)]
dipole: 0.2890198 -0.3564212 0.0002222 debye
dipolederiv: -1.6522158 -0.1168544 -0.0000342 -0.2526205 -0.315851 -0.000006 -0.0000438 -0.0000009 -0.2800129 -0.0700952 -0.1284865 -0.0000819 -0.092638 -1.3311027 0.0000059 -0.0000727 0.0000853 -0.3807663 -0.1031006 -0.1626472 0.0000698 -0.1756074 -1.4523136 -0.0000114 0.0000594 -0.0000782 -0.4283043 0.308158 -0.1855696 0.0000197 0.1448358 0.1134569 -0.0000065 0.0000145 -0.0000008 -0.0529544 -0.4936853 0.0207104 0.0000119 0.1807797 1.1304097 0.0000038 0.0000113 -0.0000185 -0.0387262 1.3925088 0.4022334 0.0000359 0.2877395 0.1458079 0.0000094 0.0000365 -0.0000183 0.1225035 -0.0990763 0.2665627 -0.0000004 -0.1713518 -0.3476145 -0.0000044 0.0000127 0.0000221 -0.2248183 0.1518842 0.0026238 -0.0000184 0.1678807 1.3679427 0.0000081 -0.0000216 0.0000341 0.0914425 -0.2318711 -0.1882312 -0.0000042 -0.1192098 -0.3408795 -0.0000031 -0.000001 -0.0000155 -0.2840835 -0.0346727 0.0653729 -0.0000109 0.0544062 -0.0198049 0.0000171 -0.0000112 0.0000296 0.0966116 0.7809087 -0.0636745 0.0000088 -0.3747347 0.2644854 -0.0000131 0.0000088 -0.0000034 0.3382147 -0.0528132 -0.0614792 -0.0000044 -0.0394824 0.0776762 -0.0000005 -0.0000046 -0.0000017 0.1766176 -0.0109832 0.0950938 -0.000002 0.1038642 -0.0105394 0.0000027 0. 0.0000015 0.1844592 0.0520809 0.0099158 -0.0362591 0.0749886 -0.0304203 -0.1137699 0.0230514 -0.1222203 -0.0459254 0.0520868 0.0099063 0.0362697 0.0749722 -0.0303915 0.1137613 -0.0230393 0.1222036 -0.0459164 -0.0602618 -0.0412343 -0.0000099 -0.1561423 0.0450485 -0.000008 -0.0000129 -0.0000042 0.1182219 0.103625 0.0834755 0.0000662 0.0590106 0.3678266 0.0000045 0.0000615 -0.0000583 0.3468458 0.0061872 -0.0098776 -0.0302686 0.1566266 -0.0192168 -0.1255044 0.0394435 -0.1093363 -0.0971781 0.0061855 -0.009881 0.0302718 0.1566246 -0.0192257 0.1255156 -0.0394384 0.10934 -0.0971755 -0.0972552 -0.0770181 -0.0000052 -0.1273998 0.0256532 -0.0000035 -0.0000059 -0.0000021 0.1230409 0.0524055 0.0890588 -0.0000546 0.0474581 0.3790528 0.0000023 -0.0000482 0.0000424 0.3779035 unknown
polarizability: 127.5813176|-2.9855226|118.6697232|0.0020206|-0.0004141|50.4847702 unknown
InChI: InChI=1S/C8H10O3/c1-5-3-6(9)4-7(11-2)8(5)10/h3-4,9-10H,1-2H3
charge 0 multiplicity 1
21 atoms
O  2.202182 0.818728 -0.00007
O  0.097194 2.464064 -0.000167
O  -0.846524 -3.094066 -0.000169
C  -1.494348 0.557417 -0.000184
C  -0.176159 1.082019 -0.000144
C  0.945798 0.203769 -0.000107
C  -1.687698 -0.844283 -0.000167
C  -0.578198 -1.708996 -0.000136
C  0.741678 -1.196495 -0.000115
C  -2.680325 1.508611 -0.000267
C  3.376267 -0.048325 -0.00006
H  -2.695148 -1.269925 -0.00019
H  1.598558 -1.880123 -0.000105
H  -2.692131 2.161689 0.896339
H  -2.691989 2.161668 -0.896888
H  -3.628078 0.946047 -0.000321
H  -0.750752 2.974323 0.000029
H  3.410738 -0.688576 -0.904857
H  3.410708 -0.688602 0.904725
H  4.238735 0.634551 -0.000035
H  -0.005011 -3.613095 -0.000009
