program: Gaussian 09
title: 000151461
version: EM64L-G09RevD.01
frameworkgroup: C1[X(C6H8N2O3)]
method: RPBEPBE
basis: SDD
operation: Freq
keyword: #pfreq=noraman
keyword: PBEPBE/SDD
title: #p freq=noraman PBEPBE/SDD
converged: YES YES NO NO
title: Mulliken charges:
elementType: O O O N N C C C C C C H H H H H H H H
charge: -0.223971 -0.211243 -0.227400 -0.189192 -0.372814 -0.276590 0.221523 0.155411 -0.671870 0.216730 -0.594471 0.286990 0.257587 0.257493 0.221761 0.368282 0.270380 0.255465 0.255926
chargesum: 0.00000
title: Mulliken charges with hydrogens summed into heavy atoms:
elementType: O O O N N C C C C C C
charge: -0.223971 -0.211243 -0.227400 -0.189192 -0.004533 0.010401 0.221523 0.155411 0.064972 0.216730 0.187301
polarizability: 1.07655031e+02 -4.95443602e+00 9.58389655e+01 3.39107585e+00 -2.66110017e+00 5.33897032e+01
1716.lowfreq: -14.6267 -5.0004 -0.0006 0.0003 0.0005 6.8652 29.8183 86.4632 91.0454
frequency: 29.7698 86.4611 90.9685 153.0260 218.2143 224.4362 250.9746 304.4580 327.1270 357.6877 383.9962 434.0461 476.5049 584.7850 618.4237 670.0098 703.5768 708.7069 749.0072 779.9942 859.9366 926.2954 1003.4908 1052.5026 1059.0025 1130.8421 1132.8044 1173.3529 1249.3319 1261.9284 1286.7414 1328.0309 1355.0406 1375.9704 1387.9074 1432.0761 1472.9674 1476.3699 1479.5017 1480.3957 1600.7824 1651.5926 1660.0727 3002.2925 3019.5050 3026.5850 3106.2844 3113.9978 3124.6574 3147.1933 3517.8373
redmass: 4.3625 4.7593 1.0247 10.1136 1.6731 1.7854 2.5686 4.3164 3.4385 10.9481 8.0827 9.8664 7.1053 9.0516 4.1684 2.7887 5.6780 7.4725 3.4498 1.7370 2.4407 2.4652 1.9827 1.9164 2.4157 1.3691 3.3021 2.6317 1.2815 4.3271 1.4637 3.4792 5.0402 1.5508 1.4372 1.3049 1.0487 1.0610 1.0600 1.0627 10.3791 5.6662 9.4538 1.0349 1.0330 1.0819 1.1005 1.1027 1.1024 1.1024 1.0768
irintensity: 3.7146 1.7021 0.0633 12.0042 0.0642 0.2836 1.9774 6.7955 4.4542 26.8572 30.8970 8.0693 18.6696 0.8519 9.4767 13.3729 2.0319 0.9574 3.2779 123.1928 1.5541 1.0462 38.3101 5.9885 3.1648 0.3905 3.3131 61.7951 13.4963 117.4505 7.4872 232.7131 182.1646 8.1897 44.3277 146.4065 22.5709 17.4682 14.1994 11.8678 426.0118 462.2689 80.5764 15.1155 18.6977 1.3071 15.9951 13.6450 4.7100 0.4942 62.8217
temp: 298.150 k
press: 1.00000 atm
elementType: 8 8 8 7 7 6 6 6 6 6 6 1 1 1 1 1 1 1 1
symmnumber: 1
zpe: 377107.6 jmol-1
zpe.correction: 0.143633 hartree
zpe.thermalcorrener: 0.154259 hartree
zpe.thermalcorrenthalpy: 0.155203 hartree
zpe.thermalcorrgfe: 0.106630 hartree
zpe.sumelectzpe: -567.832282 hartree
zpe.sumelectthermal: -567.821656 hartree
zpe.sumelectthermalent: -567.820712 hartree
zpe.sumelectthermalfe: -567.869285 hartree
dipole: 0.4901 0.5953 0.5766
dipole: 0.9628
quadrupole: -70.1048 -73.4257 -62.1250
quadrupole: -0.5321 -2.3822 1.9975
quadrupole: -1.5530 -4.8739 6.4269 -0.5321 -2.3822 1.9975
hfenergy: -567.9759149 hartree
pointgroup: C01 [X(C6H8N2O3)]
dipole: -0.121509 0.2907176 -0.2102522 debye
dipolederiv: -0.5415042 0.04305 -0.0119292 -0.1107173 -1.0544628 -0.2571567 -0.0643764 -0.2056321 -0.4190665 -0.9665808 0.2372677 -0.162711 0.3573025 -0.7101839 0.0882361 -0.1392594 0.0333704 -0.3861586 -0.9739348 -0.2589325 -0.2267862 -0.2290923 -0.7537584 -0.1519018 -0.2310981 -0.1644705 -0.4583944 -0.8295155 -0.4354898 -0.2395856 -0.0898937 -1.3327635 -0.300911 -0.2109593 -0.3959712 -0.3269152 -1.5157893 0.3369478 -0.2553646 -0.002655 -0.4996734 -0.0146621 -0.3596562 0.0547557 -0.4037151 -0.2843023 -0.0153077 0.0258405 -0.0345301 -0.2823242 -0.0058665 0.0664327 0.0161004 0.0662719 1.081368 0.4179139 0.2590155 0.240036 1.2194837 0.4232155 0.2933441 0.4423512 0.3645892 1.5503569 -0.2388386 0.3907696 0.0932923 0.9074195 0.0372161 0.478556 0.0228167 0.3336868 0.0841444 0.0782419 0.0012854 0.0952217 0.0034514 -0.0056087 -0.0903278 -0.0554299 0.1078546 1.5924705 -0.0685809 0.3372704 -0.1707401 1.8037043 0.2793197 0.3616393 0.3269144 0.4872494 0.3188647 -0.1075094 0.0011889 -0.181404 0.1135616 -0.0617651 -0.0269834 -0.0582987 0.1838774 0.0893361 0.0299188 -0.0265283 0.0329251 0.0663506 -0.011149 -0.0257298 -0.0100636 -0.0069124 0.110043 -0.0134929 0.0213924 -0.0525432 -0.0755155 -0.0201111 0.0088157 -0.0288393 0.0792565 -0.0685043 0.04399 0.0012803 0.0818848 0.0849238 0.0248669 -0.0029386 0.0221138 0.0864486 0.0537387 -0.0244105 -0.0828656 -0.0283013 0.0851229 -0.0352163 -0.0199433 0.0002833 -0.1079041 0.1450209 0.0048056 -0.053266 0.0135119 0.2340234 -0.0155555 -0.0688506 -0.0187384 0.3205883 0.1539021 -0.0668596 -0.0110735 0.045067 0.001276 -0.0138219 0.0216243 -0.0476294 0.1246817 -0.0304462 0.0041326 0.0521382 -0.0623388 0.0716297 0.0808129 0.0685933 0.0521399 0.0253186 0.0313321 0.0331536 -0.0200712 0.0029745 0.1177347 -0.0399416 -0.0588825 0.0142273 -0.0707567 unknown
polarizability: 106.5988972|1.1068781|93.2833858|11.8085435|7.6097872|57.0014162 unknown
InChI: InChI=1S/C6H8N2O3/c1-3-4(9)7-6(11)8(2)5(3)10/h3,7H,1-2H3
charge 0 multiplicity 1
19 atoms
O  -0.134044 2.400953 0.854832
O  2.268638 -1.79868 0.596341
O  -2.17186 -1.499786 -0.72291
N  -1.161839 0.473368 0.037278
N  0.05996 -1.585504 -0.070855
C  1.294554 0.448488 0.634263
C  -0.042326 1.186962 0.533851
C  1.270233 -1.058579 0.404899
C  2.331261 1.109905 -0.329044
C  -1.155812 -0.903663 -0.285213
C  -2.454267 1.181508 -0.138049
H  1.665306 0.611335 1.663863
H  2.405747 2.184726 -0.098685
H  3.313683 0.631063 -0.188184
H  2.027815 0.992302 -1.384318
H  0.032804 -2.590503 -0.27394
H  -2.292893 2.232513 0.140196
H  -3.224488 0.729094 0.507046
H  -2.784672 1.1039 -1.185973
