program: Gaussian 09
title: 000151459
version: EM64L-G09RevD.01
frameworkgroup: C1[X(C6H11NO4S)]
method: RPBEPBE
basis: SDD
operation: Freq
keyword: #p
keyword: freq=noraman
keyword: PBEPBE/SDD
title: #p freq=noraman PBEPBE/SDD
converged: YES YES NO NO
title: Mulliken charges:
elementType: S O O O O N C C C C C C H H H H H H H H H H H
charge: 0.207088 -0.416075 -0.231130 -0.418623 -0.213502 -0.565904 -0.393473 -0.145463 -0.702259 0.144770 -0.698778 0.237588 0.259876 0.222820 0.264732 0.292698 0.259014 0.279802 0.279858 0.282446 0.292962 0.378315 0.383239
chargesum: 0.00000
title: Mulliken charges with hydrogens summed into heavy atoms:
elementType: S O O O O N C C C C C C
charge: 0.207088 -0.037760 -0.231130 -0.035385 -0.213502 -0.006244 0.089223 0.119270 -0.150548 0.144770 -0.123371 0.237588
polarizability: 1.30323131e+02 4.92060979e+00 9.34491130e+01 -5.85170228e+00 6.53951512e+00 8.09046654e+01
1716.lowfreq: -8.7094 -4.7823 0.0012 0.0024 0.0027 3.6561 14.3701 20.8038 27.8778
frequency: 12.6635 20.7290 27.8207 41.5617 49.6085 105.2865 126.1395 173.0400 203.8234 233.3900 271.4834 301.0432 338.2176 368.0386 402.5192 502.0542 504.3023 566.0843 593.2336 600.3767 619.6099 636.6098 696.3844 707.6335 735.1155 747.4239 846.8693 869.3906 890.8133 936.2548 1005.0715 1032.5679 1042.7905 1053.1465 1129.3400 1146.4021 1149.9457 1165.6974 1222.6095 1231.6930 1253.1516 1293.4862 1309.3279 1315.5238 1330.8506 1377.8277 1429.5202 1433.7240 1467.6916 1651.6989 1655.8021 1676.8805 2975.1582 3014.9128 3021.8639 3023.5007 3052.4753 3083.4244 3100.8817 3440.2403 3492.6442 3514.9177 3560.1855
redmass: 7.1931 8.2876 8.6021 7.3365 3.0063 5.8791 5.6056 4.8275 1.2522 3.7718 4.2795 2.1031 2.4681 7.4549 4.2400 1.9950 3.6153 4.2055 1.7633 2.8670 2.6149 1.4013 2.8923 1.5571 3.1556 4.0837 2.2796 4.4685 1.7157 1.9729 2.2642 2.3991 2.2168 2.5127 1.5275 1.3597 1.3773 1.3408 1.3822 1.4302 1.4085 1.3652 1.3822 1.9696 1.4003 1.3809 1.0990 1.0894 1.0803 5.4636 1.1727 8.8165 1.0648 1.0579 1.0609 1.0839 1.0970 1.1035 1.1036 1.0456 1.0640 1.0640 1.0960
irintensity: 0.4674 1.5380 0.5326 0.7400 2.5041 0.7599 3.1851 0.0602 37.2078 4.2939 9.4339 2.1639 16.3845 8.3482 21.8314 26.0248 18.9552 44.6566 69.7939 18.2337 43.5034 128.7177 78.9323 199.6832 28.9155 9.7111 4.7606 15.5072 8.3970 20.9239 77.4470 157.4214 329.8979 8.2071 22.9432 7.3226 0.0989 3.6449 1.1944 4.2809 4.8702 5.7343 28.3689 28.2584 19.6097 2.1651 41.2944 17.2097 15.2550 183.0437 108.5806 195.7448 19.0747 16.2615 31.5316 9.7836 16.4546 3.3371 5.1045 1.0775 12.1849 24.6717 4.5144
temp: 298.150 k
press: 1.00000 atm
elementType: 16 8 8 8 8 7 6 6 6 6 6 6 1 1 1 1 1 1 1 1 1 1 1
symmnumber: 1
zpe: 459261.2 jmol-1
zpe.correction: 0.174923 hartree
zpe.thermalcorrener: 0.189336 hartree
zpe.thermalcorrenthalpy: 0.190280 hartree
zpe.thermalcorrgfe: 0.129078 hartree
zpe.sumelectzpe: -987.990200 hartree
zpe.sumelectthermal: -987.975788 hartree
zpe.sumelectthermalent: -987.974843 hartree
zpe.sumelectthermalfe: -988.036046 hartree
dipole: -0.3362 0.9564 1.8552
dipole: 2.1141
quadrupole: -76.3986 -78.8132 -77.2451
quadrupole: 10.9730 4.9217 -4.4369
quadrupole: 1.0871 -1.3276 0.2405 10.9730 4.9217 -4.4369
hfenergy: -988.1651235 hartree
pointgroup: C01 [X(C6H11N1O4S1)]
dipole: -0.1530948 -0.5404943 -0.6133796 debye
dipolederiv: -0.1737206 -0.0720401 0.0336819 -0.042675 -0.0181908 0.1157049 0.0349468 0.04582 -0.1057207 -0.3083803 -0.0627456 0.0182389 -0.1876349 -1.1750641 0.0746005 0.0902619 0.0596262 -0.3860068 -1.0740741 -0.2211973 0.053005 -0.0322177 -0.6297963 0.0499882 -0.0484702 0.0172133 -0.2964762 -0.9759911 0.5030858 0.2236667 0.4734976 -0.7361725 -0.0924302 0.2035042 -0.06951 -0.41739 -0.6972094 -0.0944176 -0.1856383 0.1154793 -0.6639547 -0.2431925 -0.0557369 -0.3121308 -0.5460264 -0.5166805 0.1919476 0.0283476 0.1335769 -0.642695 0.2115576 0.1012761 0.1584654 -0.2952842 -0.0065256 -0.0272792 0.0196097 -0.0012934 -0.0381666 0.0333064 -0.1642887 0.0724046 0.0334411 -0.0124141 0.0579078 0.0028577 -0.0122849 0.3637196 -0.2009407 -0.0207062 -0.2085998 0.2467227 0.3234107 0.1218196 0.0996276 0.149244 0.0691029 0.0005727 0.1599823 0.0504872 0.1186313 1.3284317 0.2210452 -0.05484 0.0943095 1.3058882 -0.0709236 0.0683323 -0.0510637 0.078771 -0.1756028 -0.1260279 -0.1432546 -0.3552802 0.0410924 -0.1657114 -0.2143383 -0.0949003 0.0163396 1.5514368 -0.351433 0.1230965 -0.3041873 1.0004172 0.5244029 0.1229989 0.4909197 0.6197849 -0.0168614 0.1199207 0.01263 0.1142321 -0.011297 0.0082206 0.0472571 0.0204446 0.0681943 -0.0835658 -0.0931873 -0.1172185 -0.0982037 0.0472332 -0.0534184 -0.0434847 -0.032538 -0.026467 0.1456873 -0.0144065 -0.0958144 0.0305324 -0.0014425 -0.0535362 -0.0779631 -0.0238276 0.035933 0.0185775 0.0597937 -0.0665322 0.0090108 -0.0090972 0.0257194 -0.0907552 -0.0009261 0.1044678 -0.0493154 -0.0287 0.0777303 -0.0545109 0.0575554 -0.070551 0.0328991 -0.0282671 -0.1319261 0.149026 -0.1782569 -0.0607554 -0.0680716 0.2728563 0.0233527 -0.0860988 0.0008609 0.1358002 0.2113157 -0.1034884 0.153618 -0.0446052 0.1892019 -0.0808796 0.0776979 -0.0255513 0.0600783 0.0282888 0.049422 0.0042763 0.1131621 0.0473574 -0.0333637 0.0248186 -0.0514883 -0.0481791 0.0553173 -0.0023386 0.0030659 0.0409853 -0.0591977 0.0609603 0.0107269 0.0472872 0.0682263 0.0714898 0.094581 -0.0262315 0.0152335 0.2794136 0.030258 -0.0466276 0.0197374 0.3757806 0.2073595 -0.0440048 -0.1031672 -0.0882986 0.3112363 -0.0936967 -0.1262324 -0.0844634 0.2913056 unknown
polarizability: 130.5988991|-3.5602584|95.8401033|5.4966618|2.8735694|78.2379066 unknown
InChI: InChI=1S/C6H11NO4S/c7-4(6(10)11)1-2-12-3-5(8)9/h4,8,10H,1-3,7H2
charge 0 multiplicity 1
23 atoms
S  1.135454 1.069117 -0.244794
O  -2.726946 1.638179 0.142871
O  -4.177403 -0.170072 0.270177
O  4.578429 -1.066669 -0.212777
O  3.926123 0.812194 0.99333
N  -2.005011 -1.86531 1.127697
C  -1.008277 -0.770444 -0.864307
C  -1.729421 -0.564513 0.502932
C  -0.245092 0.456191 -1.393487
C  -3.007376 0.272352 0.304471
C  2.294218 -0.407954 -0.426271
C  3.638611 -0.108838 0.204489
H  -0.322268 -1.622241 -0.705938
H  -1.741658 -1.095151 -1.631831
H  -1.038347 0.008564 1.149295
H  -0.904167 1.334268 -1.492442
H  0.208725 0.23992 -2.37659
H  -2.740938 -2.390913 0.639539
H  -2.216056 -1.798775 2.129527
H  2.434468 -0.647838 -1.493758
H  1.864236 -1.293916 0.074172
H  -3.578325 2.140471 0.014762
H  5.45102 -0.883522 0.230935
