program: Gaussian 09
title: 000151456
version: EM64L-G09RevD.01
frameworkgroup: C1[X(C10H22O2S)]
method: RPBEPBE
basis: SDD
operation: Freq
keyword: #p
keyword: freq=noraman
keyword: PBEPBE/SDD
title: #p freq=noraman PBEPBE/SDD
converged: YES YES NO NO
title: Mulliken charges:
elementType: S O O C C C C C C C C C C H H H H H H H H H H H H H H H H H H H H H H
charge: 0.635634 -0.630995 -0.464147 -0.378445 -0.371481 -0.372356 -0.321404 -0.353047 -0.715727 -0.356309 -0.607133 -0.695694 -0.302654 0.192021 0.201423 0.204645 0.190685 0.193001 0.188168 0.205260 0.245212 0.190794 0.187503 0.314710 0.253202 0.196164 0.194003 0.273770 0.249954 0.209426 0.210890 0.215730 0.223088 0.225174 0.368936
chargesum: 0.00000
title: Mulliken charges with hydrogens summed into heavy atoms:
elementType: S O O C C C C C C C C C C
charge: 0.635634 -0.630995 -0.095211 0.014999 0.023850 0.008812 0.129068 0.025250 -0.147815 0.033857 -0.083409 -0.059648 0.145608
polarizability: 1.86659547e+02 -3.21487868e+00 1.13090050e+02 3.12285019e+00 -2.92322090e-01 1.21647379e+02
1716.lowfreq: -5.0823 -0.0017 -0.0014 -0.0010 6.6856 16.8481 24.0890 40.3168 46.7368
frequency: 22.5248 40.1655 46.7306 48.7237 80.8584 94.9764 107.3395 128.5858 140.2817 154.6264 170.1621 186.2282 217.3385 229.7738 266.1759 282.7612 304.0321 325.0108 355.6620 431.1401 462.3580 489.6086 525.3698 615.2443 725.7979 731.2544 735.2798 759.3357 794.6317 823.9367 850.7557 874.3993 888.7462 912.7538 932.3157 982.7731 992.1288 1004.1221 1011.5937 1017.3639 1040.3371 1071.4085 1075.4546 1077.6512 1080.2530 1119.3743 1144.8384 1176.2633 1186.9929 1211.8270 1222.4298 1241.0583 1259.1698 1260.0399 1281.0975 1283.3167 1287.9811 1295.9134 1302.1076 1318.4839 1344.1237 1354.4304 1356.0608 1356.7070 1389.8466 1406.6784 1428.1747 1432.8198 1451.3756 1462.0773 1462.4978 1467.3035 1471.6106 1477.4271 1478.4306 1485.2171 1488.9521 2950.9883 2953.8278 2957.8525 2963.9722 2968.3180 2971.9634 2980.1617 2980.8872 2986.6730 2996.7062 3007.5733 3008.2220 3024.0528 3029.8561 3037.6450 3050.6211 3051.6597 3068.5453 3071.0525 3099.2673 3114.4071 3120.4751
redmass: 4.4952 4.2061 3.9243 1.7281 3.7965 1.5962 3.3966 2.8080 1.7572 2.2286 4.3034 2.9732 2.6758 1.1213 6.6381 3.7211 3.1785 6.8595 4.0292 3.1826 3.6345 3.7974 3.4099 4.8913 1.0664 10.6129 1.0847 1.1207 1.1811 1.7630 1.1952 1.1751 1.8919 1.8357 1.2579 2.0050 2.4885 1.1849 4.1266 3.6151 3.3401 2.8533 2.3746 1.1900 2.1281 2.5711 1.2560 1.2389 1.7784 1.2426 1.4427 1.2435 1.2132 1.2712 1.2815 1.0279 1.1688 1.0787 1.1110 1.3388 1.4329 1.5459 1.6618 1.2268 1.2172 1.1110 1.1557 1.1059 1.0652 1.0722 1.0744 1.0680 1.0768 1.0423 1.0789 1.0877 1.0943 1.0588 1.0589 1.0591 1.0594 1.0589 1.0365 1.0606 1.0611 1.0965 1.0986 1.0734 1.0831 1.1037 1.0579 1.1042 1.1042 1.0978 1.1007 1.0993 1.1093 1.0701 1.1070
irintensity: 2.0526 1.0066 2.9052 0.9887 1.4073 0.1526 2.9325 1.6892 0.0352 0.2316 2.4240 3.0040 6.5557 0.0058 12.7494 4.7854 3.1886 20.0581 1.7409 0.7354 0.8834 0.4104 1.1555 1.4875 14.0572 35.2408 0.8854 17.9252 10.7163 7.9860 57.1688 123.2774 5.2423 24.4977 5.7699 2.8407 2.9512 0.5529 68.9293 0.4415 0.7008 5.0676 0.6234 0.4672 0.4572 14.9771 3.9456 7.3819 0.1417 6.1655 0.6440 12.3921 12.4130 3.1037 3.1291 0.5751 0.4150 0.6009 0.6304 4.1101 6.7652 0.0738 0.0862 2.2017 11.4817 12.1778 49.9447 1.4919 8.2797 0.0409 0.0781 1.0918 0.9406 12.4376 2.0801 1.8380 31.6346 0.1067 3.4773 1.6890 8.3381 145.5165 37.4924 47.0004 54.6829 2.2754 1.0069 9.3064 5.7278 0.4228 14.3638 65.3898 81.6880 55.0847 95.6277 55.0970 13.4439 155.4946 15.4775
temp: 298.150 k
press: 1.00000 atm
elementType: 16 8 8 6 6 6 6 6 6 6 6 6 6 1 1 1 1 1 1 1 1 1 1 1 1 1 1 1 1 1 1 1 1 1 1
symmnumber: 1
zpe: 803934.3 jmol-1
zpe.correction: 0.306202 hartree
zpe.thermalcorrener: 0.323593 hartree
zpe.thermalcorrenthalpy: 0.324537 hartree
zpe.thermalcorrgfe: 0.258784 hartree
zpe.sumelectzpe: -941.590612 hartree
zpe.sumelectthermal: -941.573221 hartree
zpe.sumelectthermalent: -941.572277 hartree
zpe.sumelectthermalfe: -941.638030 hartree
dipole: 0.5603 -2.4505 -3.9605
dipole: 4.6909
quadrupole: -83.0667 -96.3660 -93.7370
quadrupole: 8.3565 12.9814 2.3619
quadrupole: 7.9899 -5.3094 -2.6804 8.3565 12.9814 2.3619
hfenergy: -941.896814 hartree
pointgroup: C01 [X(C10H22O2S1)]
dipole: -0.3166683 -1.6123272 -0.8403132 debye
polarizability: 186.3799026|-5.8964074|121.9641341|1.5278346|-0.9186636|113.0529397 unknown
InChI: InChI=1S/C10H22O2S/c1-2-3-4-5-6-7-9-13(12)10-8-11/h11H,2-10H2,1H3
charge 0 multiplicity 1
35 atoms
S  3.312963 -0.153766 -1.268702
O  3.317359 1.381835 -0.530175
O  4.040172 0.164575 1.739062
C  -2.021019 0.121501 -0.448878
C  -0.754685 -0.695206 -0.10397
C  -3.288042 -0.389452 0.273062
C  0.505401 -0.1624 -0.830775
C  -4.55681 0.420387 -0.077471
C  1.745909 -0.986793 -0.482337
C  -5.825878 -0.089521 0.642962
C  4.637993 -1.184644 -0.247469
C  -7.08945 0.721907 0.283674
C  5.144707 -0.299622 0.904441
H  -2.188308 0.094572 -1.545915
H  -1.851714 1.185903 -0.185346
H  -0.586048 -0.665448 0.991997
H  -0.921787 -1.759873 -0.369491
H  -3.124136 -0.355975 1.370488
H  -3.453033 -1.45691 0.015464
H  0.330285 -0.173842 -1.92534
H  0.683908 0.89063 -0.537769
H  -4.394342 1.487867 0.180472
H  -4.722238 0.388106 -1.174923
H  1.962032 -1.001907 0.600429
H  1.722229 -2.011738 -0.894474
H  -5.661139 -0.054102 1.739299
H  -5.985517 -1.157143 0.387166
H  4.099635 -2.074686 0.116432
H  5.425258 -1.466389 -0.967507
H  -7.291597 0.679229 -0.803388
H  -6.968525 1.786567 0.559559
H  -7.982644 0.3364 0.808943
H  5.719095 0.555082 0.492705
H  5.815128 -0.8954 1.550129
H  3.593437 0.876757 1.166645
