program: Gaussian 09
title: 000151451
version: EM64L-G09RevD.01
frameworkgroup: C1[X(C9H8O3)]
method: RPBEPBE
basis: SDD
operation: Freq
keyword: #p
keyword: freq=noraman
keyword: PBEPBE/SDD
title: #p freq=noraman PBEPBE/SDD
converged: YES YES NO NO
title: Mulliken charges:
elementType: O O O C C C C C C C C C H H H H H H H H
charge: -0.178459 -0.374739 -0.228461 0.445525 0.305804 -0.388271 -0.375337 -0.311166 -0.335635 -0.800855 0.038688 0.093645 0.237742 0.238764 0.265939 0.275079 0.231112 0.230742 0.244292 0.385588
chargesum: 0.00000
title: Mulliken charges with hydrogens summed into heavy atoms:
elementType: O O O C C C C C C C C C
charge: -0.178459 0.010850 -0.228461 0.445525 0.305804 -0.150529 -0.136573 -0.045227 -0.060556 -0.094708 0.038688 0.093645
polarizability: 1.66101039e+02 -7.34726914e+00 1.08140019e+02 -1.98201456e+00 1.83768842e-01 5.29397218e+01
1716.lowfreq: -11.3762 -2.5938 -0.0009 0.0003 0.0008 9.0366 20.9209 34.2346 46.7931
frequency: 19.7791 34.1683 46.7760 97.4094 142.2119 237.0164 247.8475 303.2045 341.7346 366.6721 399.2361 409.1118 486.1611 583.1731 591.8821 633.2169 644.4476 680.3215 718.3701 769.4533 794.4889 845.7315 859.7099 926.5731 974.5934 990.1499 998.9112 1012.0045 1045.9502 1064.7394 1129.7866 1197.7544 1227.9839 1238.6453 1313.8829 1321.9188 1373.2407 1396.7689 1416.5039 1466.5912 1472.4219 1500.9607 1553.3240 1581.3677 1619.5525 1627.7861 2978.0102 3060.3692 3092.4284 3129.9358 3133.8251 3159.4381 3174.0987 3496.0792
redmass: 1.0368 8.0633 4.8899 4.7033 6.0474 5.6761 5.5849 5.9868 3.3797 6.3620 3.3121 3.8081 2.8052 3.5259 2.5189 6.5463 2.2707 4.0309 3.5689 3.2755 5.2642 1.6168 1.3599 8.3216 1.3644 1.4126 1.3720 2.8919 1.6100 2.5024 1.3100 1.1546 3.0345 2.5549 1.4347 2.6362 4.4884 1.2187 3.7697 1.1098 1.0603 2.5693 7.4694 7.8209 6.7775 9.0445 1.0394 1.0938 1.1002 1.0890 1.0901 1.0956 1.0948 1.0640
irintensity: 0.7773 3.5905 0.6591 0.1921 0.7151 3.0363 5.8163 2.2923 2.6962 1.4832 1.4073 4.6083 11.1399 87.7885 47.5632 3.1374 93.7853 54.2408 18.4533 19.5741 0.9703 21.7650 9.8214 130.3711 0.6291 8.1563 1.1434 2.6675 33.8296 250.2268 9.9975 40.3093 0.7325 88.1205 5.3692 10.3685 6.8495 17.4824 13.2836 18.5274 13.7717 4.1724 176.8569 124.2824 45.7270 200.7482 17.8008 19.7893 14.9204 12.7868 12.9379 7.8295 3.0910 36.1420
temp: 298.150 k
press: 1.00000 atm
elementType: 8 8 8 6 6 6 6 6 6 6 6 6 1 1 1 1 1 1 1 1
symmnumber: 1
zpe: 388354.0 jmol-1
zpe.correction: 0.147916 hartree
zpe.thermalcorrener: 0.159262 hartree
zpe.thermalcorrenthalpy: 0.160206 hartree
zpe.thermalcorrgfe: 0.108190 hartree
zpe.sumelectzpe: -572.567883 hartree
zpe.sumelectthermal: -572.556536 hartree
zpe.sumelectthermalent: -572.555592 hartree
zpe.sumelectthermalfe: -572.607609 hartree
dipole: 3.1124 -1.8937 1.0810
dipole: 3.8003
quadrupole: -53.7652 -70.8424 -72.7832
quadrupole: 6.9643 -3.1884 -3.6314
quadrupole: 12.0318 -5.0455 -6.9863 6.9643 -3.1884 -3.6314
hfenergy: -572.7157988 hartree
pointgroup: C01 [X(C9H8O3)]
dipole: 1.230185 0.6614759 -0.5334124 debye
dipolederiv: -0.8832046 -0.0915121 0.0685123 -0.5733842 -0.6935618 0.1174296 0.123583 0.1118488 -0.3195564 -1.0764826 -0.2474679 -0.3982898 -0.1212954 -0.2549164 -0.048636 -0.4860855 -0.0879991 -0.6518547 -0.7087001 0.1586241 -0.083364 -0.0377487 -0.7413521 -0.3137194 -0.1929576 -0.1461181 -0.4741723 0.6456723 0.0843876 -0.0185888 0.1258349 0.1143166 -0.0227341 0.0440102 -0.0142326 0.000833 -1.0706312 -0.1492844 0.0650203 -0.0337888 -0.1359474 0.0324951 0.0101278 0.0461559 -0.0363023 -0.4698463 0.0990219 -0.0109732 0.2678387 0.0937328 -0.0566821 -0.0337939 -0.0485754 -0.1603692 -0.3085429 -0.2281793 0.0522126 -0.3835614 -0.0570394 -0.011718 0.085472 -0.0197145 -0.1665225 0.2915742 -0.0533813 -0.0021733 0.2477831 0.0374253 -0.0466206 -0.096 -0.0091829 -0.0803136 0.2663682 0.1518112 -0.0447262 -0.2057958 0.0261083 -0.0116952 0.0014705 -0.0267497 -0.0850509 -0.2830881 -0.0563288 0.000246 -0.0751025 0.0637502 -0.0039235 -0.1718906 -0.0286867 0.0599659 1.7139379 0.1503402 -0.1408444 0.4909909 0.6858464 -0.1992622 -0.0878986 -0.1830256 0.2162061 1.3213789 0.055311 0.5142658 0.0897656 0.7383542 0.4712751 0.6595981 0.3201537 0.7024651 0.0414048 -0.073892 0.0241971 -0.0804618 -0.065489 0.0468875 0.025792 0.0495096 0.1394298 -0.024868 0.103827 -0.011614 0.1017726 -0.0094176 0.0300398 -0.0007227 0.0238657 0.144919 0.0873458 0.0688114 -0.0103035 0.0630923 0.0360871 0.0266134 -0.0245902 0.0160008 0.1426038 0.1024051 -0.0667484 0.0141787 -0.0125025 0.012033 0.028832 0.0038183 0.0300271 0.1450574 0.0091973 0.0357851 0.0347628 0.1067916 -0.0618849 -0.0750518 0.0889967 -0.0406597 0.08584 0.0445393 0.0011501 0.0055978 -0.0551517 -0.0383136 0.1202626 0.0880982 0.1078334 0.0282058 -0.0193075 -0.0298163 -0.0475649 -0.0389418 0.1054995 -0.0368734 -0.0697408 -0.0418513 -0.0699785 0.3208474 0.0875409 -0.0105514 0.123865 0.1447684 -0.0469186 0.0327133 -0.0585992 0.3785946 unknown
polarizability: 166.3303962|6.5485405|106.9609458|-0.1864901|-7.2790619|53.8894373 unknown
InChI: InChI=1S/C9H8O3/c1-6-2-4-7(5-3-6)8(10)9(11)12/h2-5,11H,1H3
charge 0 multiplicity 1
20 atoms
O  -2.006553 -1.757769 0.552791
O  -3.643426 0.137973 -0.682793
O  -2.4886 1.682398 0.613038
C  2.70931 0.138524 -0.041244
C  -0.107778 -0.297316 0.183906
C  1.789199 1.205505 -0.217776
C  2.192456 -1.156112 0.246306
C  0.400307 1.000458 -0.105487
C  0.810089 -1.373007 0.358614
C  4.203708 0.37632 -0.130224
C  -1.55669 -0.607352 0.286581
C  -2.570767 0.543135 0.099664
H  2.169443 2.209203 -0.440813
H  2.886771 -1.994013 0.37974
H  -0.283935 1.845096 -0.224441
H  0.407462 -2.368248 0.575293
H  4.735871 -0.514219 -0.507569
H  4.441853 1.228419 -0.789923
H  4.621841 0.607622 0.869167
H  -4.31696 0.871484 -0.732432
