program: Gaussian 09
title: 000151448
version: EM64L-G09RevD.01
frameworkgroup: C1[X(C19H26O3)]
method: RPBEPBE
basis: SDD
operation: Freq
keyword: #pfreq=noraman
keyword: PBEPBE/SDD
title: #p freq=noraman PBEPBE/SDD
converged: YES YES NO NO
title: Mulliken charges:
elementType: O O O C C C C C C C C C C C C C C C C C C C H H H H H H H H H H H H H H H H H H H H H H H H H H
charge: -0.209778 -0.435571 -0.233772 -0.129257 -0.107860 -0.147041 0.204111 0.232790 -0.539816 -0.496881 -0.477694 -0.543430 0.537539 0.076704 -0.640172 -0.511962 -0.493650 -0.409186 -0.806961 -0.564228 -0.585103 0.179052 0.229758 0.207408 0.222231 0.231050 0.233743 0.212622 0.240642 0.222777 0.218082 0.236639 0.217361 0.223652 0.237273 0.248273 0.254520 0.219244 0.219144 0.207372 0.235294 0.218434 0.231162 0.235824 0.246955 0.232158 0.255781 0.364766
chargesum: 0.00000
title: Mulliken charges with hydrogens summed into heavy atoms:
elementType: O O O C C C C C C C C C C C C C C C C C C C
charge: -0.209778 -0.070805 -0.233772 0.100501 0.099548 0.075190 0.204111 0.232790 -0.075023 -0.043616 -0.036835 -0.089430 0.537539 0.076704 -0.179246 -0.009168 -0.055261 0.033479 -0.121541 -0.085116 -0.329322 0.179052
polarizability: 2.66611950e+02 -2.59871768e+00 1.90992276e+02 -7.83567912e+00 2.20181832e+00 1.55298474e+02
1716.lowfreq: -16.2673 -6.9129 -0.0006 0.0005 0.0007 11.8205 33.6242 41.9833 68.7819
frequency: 33.0636 41.8710 68.6760 97.8008 111.6949 135.4011 151.4878 170.3417 181.6243 201.7675 211.4074 224.1724 229.3818 245.9974 265.0288 281.0933 289.5540 311.1211 323.5808 369.5330 384.6754 390.0577 416.7122 430.6202 450.0351 461.7023 476.4103 495.1161 519.0804 528.0353 534.3848 549.3756 572.0748 608.1009 631.5125 649.0413 672.9715 694.1438 740.6813 775.8353 805.2014 814.2694 829.9977 841.0064 859.2422 877.9914 892.0575 914.2873 923.4113 939.1715 949.9616 962.1424 977.9617 985.4865 994.9968 998.9485 1008.2433 1020.5313 1030.6865 1044.1319 1068.9763 1077.6359 1086.6620 1102.0464 1112.3356 1122.0794 1125.2230 1132.8493 1156.2182 1165.3075 1167.5210 1184.1489 1188.5048 1194.0666 1199.9629 1225.6671 1233.5556 1245.0988 1254.2617 1257.4007 1266.8696 1278.9897 1283.9604 1290.5185 1298.6018 1305.1567 1319.6535 1322.8829 1327.3127 1329.7905 1337.3334 1344.1068 1348.1100 1353.8929 1356.4591 1371.0579 1381.6495 1389.6073 1427.7343 1444.5016 1456.2230 1459.0311 1465.0439 1467.0898 1468.3629 1480.8184 1483.1337 1486.0326 1494.8158 1586.0052 1624.5769 1627.3522 2903.9924 2915.4047 2948.0691 2953.7170 2960.6243 2970.8750 2974.8276 2980.1998 2986.8285 2987.1131 2990.7091 2995.1017 3002.1395 3034.4727 3040.8670 3042.9412 3050.3946 3063.3235 3065.6540 3066.0504 3070.7334 3076.7101 3078.0268 3085.5787 3117.2907 3462.3970
redmass: 6.4991 3.9639 5.2936 4.9110 3.8493 3.8474 4.4132 2.6275 1.9281 2.3600 2.5372 2.7744 2.2452 2.6475 2.6129 3.1190 2.3973 2.5273 2.6473 3.2444 2.4899 3.4413 3.0960 2.7397 3.3679 1.5610 2.5137 3.5849 2.6676 2.5190 2.3691 2.5428 3.4758 3.9767 3.4101 3.8145 3.3105 3.1106 2.7279 2.1458 2.2066 1.8618 2.0618 2.3456 2.1642 1.8987 1.5450 1.9712 1.7758 2.1572 1.8243 2.4000 2.2910 3.5830 2.5938 1.9332 2.0958 2.2405 1.9938 2.3573 2.4011 2.5012 1.6873 2.3926 2.3297 2.2691 1.6858 1.8244 1.5857 1.8883 1.5182 1.7154 1.8178 1.7282 1.5506 1.4561 1.6598 1.4508 1.4226 1.9059 1.4742 2.0073 1.3221 1.4439 1.3508 1.2678 1.4094 1.4638 1.3986 1.3105 1.5524 2.0406 1.4650 1.4137 1.4344 1.4616 1.2011 1.2097 1.0806 1.0786 1.0855 1.0837 1.0849 1.0859 1.0863 1.0554 1.0863 1.0649 1.0763 10.0045 7.7845 11.2309 1.0813 1.0807 1.0689 1.0665 1.0752 1.0690 1.0658 1.0624 1.0628 1.0402 1.0647 1.0591 1.0638 1.0976 1.0969 1.0991 1.0978 1.0955 1.0985 1.0969 1.0928 1.1011 1.0989 1.0990 1.0913 1.0662
irintensity: 3.2545 3.1333 0.8661 6.4613 2.2405 3.2897 2.9434 2.4640 1.0338 2.4855 0.4699 1.1157 1.2476 0.0415 0.3351 0.2533 0.4469 2.5214 2.0231 3.6250 2.0170 3.5373 15.3269 18.7649 3.0139 113.4303 14.5630 6.8412 1.0880 1.1110 3.1713 0.5681 1.6181 12.0576 1.5604 0.6501 6.5853 6.1160 0.8803 6.0176 0.6846 2.7622 6.5756 5.1221 6.6926 18.4105 6.6667 4.8788 3.2917 25.4856 20.0488 7.4213 9.3370 46.3619 52.4381 2.6690 14.6903 10.0065 21.8049 3.4437 0.5177 5.2566 6.2966 11.6963 2.4712 19.2243 12.4225 2.7139 21.8056 20.0782 3.6045 2.1102 22.0079 1.3470 5.0295 5.2419 24.7522 23.4276 5.7047 33.1743 2.4025 38.8707 0.6279 5.6132 7.1985 7.4035 4.1504 4.0042 10.0616 4.5120 8.8948 4.7692 1.7718 1.5638 3.3603 2.9747 47.3853 17.0982 20.7065 18.2839 22.6564 8.0608 12.0292 6.7350 3.6095 6.1925 9.0438 2.3007 9.2634 163.1192 222.8835 133.8694 9.2052 17.1573 43.9519 14.6929 13.1804 38.9775 22.0759 31.9631 27.9162 8.1631 12.5616 27.5410 28.4134 49.2225 17.9143 49.5419 34.3770 21.9006 20.8581 9.6038 29.6923 29.4912 31.9728 26.5728 10.5968 22.8361
temp: 298.150 k
press: 1.00000 atm
elementType: 8 8 8 6 6 6 6 6 6 6 6 6 6 6 6 6 6 6 6 6 6 6 1 1 1 1 1 1 1 1 1 1 1 1 1 1 1 1 1 1 1 1 1 1 1 1 1 1
symmnumber: 1
zpe: 1080198.8 jmol-1
zpe.correction: 0.411426 hartree
zpe.thermalcorrener: 0.431531 hartree
zpe.thermalcorrenthalpy: 0.432475 hartree
zpe.thermalcorrgfe: 0.364293 hartree
zpe.sumelectzpe: -963.602145 hartree
zpe.sumelectthermal: -963.582041 hartree
zpe.sumelectthermalent: -963.581096 hartree
zpe.sumelectthermalfe: -963.649278 hartree
dipole: -2.4285 2.8925 1.2574
dipole: 3.9806
quadrupole: -186.4241 -129.1008 -133.6204
quadrupole: -17.2748 8.2633 3.4165
quadrupole: -36.7090 20.6143 16.0947 -17.2748 8.2633 3.4165
hfenergy: -964.0135712 hartree
pointgroup: C01 [X(C19H26O3)]
dipole: -0.9582822 1.1409513 0.4822235 debye
polarizability: 266.4650491|-2.2120135|191.0312942|-8.996012|1.4560178|155.4063576 unknown
InChI: InChI=1S/C19H26O3/c1-18-8-6-13(21)10-12(18)2-3-14-15(18)7-9-19(11-20)16(14)4-5-17(19)22/h10,14-16,20H,2-9,11H2,1H3
charge 0 multiplicity 1
48 atoms
O  -4.922998 -0.791219 -0.935338
O  -3.638839 -2.077065 1.4107
O  5.903997 0.11113 -0.942437
C  -0.414675 0.847224 0.409378
C  0.388673 -0.325353 -0.250552
C  -1.792267 0.922885 -0.277512
C  -2.60235 -0.397824 -0.144228
C  1.845415 -0.501879 0.350064
C  -0.414122 -1.662535 -0.288172
C  -1.846486 -1.526452 -0.87492
C  0.368257 2.170772 0.269092
C  -2.809519 2.043234 0.070766
C  2.556743 0.864504 0.334167
C  -3.989718 0.010302 -0.658457
C  1.78516 2.053262 0.878163
C  -4.103474 1.545558 -0.637808
C  2.627871 -1.51898 -0.539808
C  -2.904783 -0.818196 1.347529
C  1.80631 -1.013415 1.825979
C  4.155837 -1.49432 -0.327826
C  3.846265 1.024202 -0.106969
C  4.72603 -0.09002 -0.514103
H  -0.553471 0.642686 1.491926
H  0.5414 -0.013712 -1.310904
H  -1.58254 1.032456 -1.367842
H  -0.484772 -2.09386 0.728112
H  0.135846 -2.402232 -0.897876
H  -1.790493 -1.282839 -1.954595
H  -2.379197 -2.488663 -0.778006
H  -0.177525 2.995334 0.766421
H  0.447988 2.434893 -0.805929
H  -2.492753 3.034833 -0.294075
H  -2.9655 2.124305 1.163112
H  1.680827 1.938147 1.978483
H  2.359641 2.982869 0.713181
H  -4.134126 1.897123 -1.68905
H  -5.051362 1.862307 -0.169368
H  2.417531 -1.288533 -1.604168
H  2.251836 -2.541213 -0.350807
H  -3.459516 -0.011769 1.874053
H  -1.969018 -1.001069 1.898985
H  1.22368 -0.345186 2.484216
H  1.356504 -2.020098 1.880228
H  2.827106 -1.077793 2.242757
H  4.671607 -2.1820 -1.020975
H  4.412854 -1.828835 0.698256
H  4.305612 2.02139 -0.130076
H  -4.398686 -2.039456 0.766928
