program: Gaussian 09
title: 000013562
version: EM64L-G09RevD.01
frameworkgroup: C1[X(C4H9NO2)]
method: RPBEPBE
basis: SDD
operation: Freq
keyword: #pfreq=noraman
keyword: PBEPBE/SDD
title: #p freq=noraman PBEPBE/SDD
converged: YES YES NO NO
title: Mulliken charges:
elementType: O O N C C C C H H H H H H H H H
charge: -0.438611 -0.262761 -0.617473 -0.395385 -0.495806 -0.305768 0.238822 0.235179 0.226720 0.210015 0.231335 0.210836 0.179674 0.333552 0.335999 0.313673
chargesum: 0.00000
title: Mulliken charges with hydrogens summed into heavy atoms:
elementType: O O N C C C C
charge: -0.105058 -0.262761 0.032198 0.066514 -0.054457 0.084741 0.238822
polarizability: 6.99953234e+01 3.84343197e+00 5.95498841e+01 1.97652151e+00 1.37508412e+00 4.14672100e+01
1716.lowfreq: -18.0419 -10.0347 -0.0011 -0.0005 -0.0002 8.6611 40.2755 78.0266 112.1446
frequency: 40.1128 77.9835 112.1345 142.5082 289.8134 319.9213 353.3760 456.1484 501.0430 526.7756 595.6932 674.4068 764.0029 842.4660 864.2091 964.2631 1031.0463 1053.8360 1064.1047 1081.6556 1133.8249 1236.6001 1255.5844 1280.7994 1304.6579 1338.8751 1372.1546 1385.1981 1445.6932 1470.1746 1485.4381 1596.0381 1644.8279 2939.7691 2971.7360 2994.3742 3026.8469 3050.7585 3074.2328 3516.3924 3558.7930 3673.4874
redmass: 3.2080 2.2969 2.8419 3.4722 4.4686 1.3373 2.4915 2.2596 1.3717 1.9860 1.7658 2.1050 1.1704 2.7030 1.5297 3.7830 2.5282 2.5489 2.3798 1.7586 1.2487 1.2849 1.4300 1.1158 1.3881 1.5579 2.1648 1.2617 1.0966 1.0751 1.0922 1.4228 3.6393 1.0695 1.0600 1.0605 1.0987 1.0959 1.1017 1.0447 1.0661 1.1042
irintensity: 7.8093 11.1785 5.5368 3.6973 1.5513 93.9070 81.8691 2.8672 111.8393 97.6201 64.6756 51.1089 16.5641 4.3462 1.4969 102.9308 5.0222 0.7837 1.5725 22.2665 7.5920 19.0820 42.8985 14.4291 32.5900 26.9787 90.3693 30.5632 13.3793 2.5726 11.8768 59.8708 287.2629 71.3847 17.1332 24.8923 15.5093 9.7197 64.1392 28.7466 6.7534 22.4823
temp: 298.150 k
press: 1.00000 atm
elementType: 8 8 7 6 6 6 6 1 1 1 1 1 1 1 1 1
symmnumber: 1
zpe: 349978.0 jmol-1
zpe.correction: 0.133300 hartree
zpe.thermalcorrener: 0.141793 hartree
zpe.thermalcorrenthalpy: 0.142737 hartree
zpe.thermalcorrgfe: 0.099382 hartree
zpe.sumelectzpe: -362.450204 hartree
zpe.sumelectthermal: -362.441711 hartree
zpe.sumelectthermalent: -362.440767 hartree
zpe.sumelectthermalfe: -362.484121 hartree
dipole: -2.3354 -3.1118 0.4076
dipole: 3.9120
quadrupole: -45.1833 -41.8843 -43.3692
quadrupole: 11.6797 5.7254 0.2857
quadrupole: -1.7044 1.5946 0.1098 11.6797 5.7254 0.2857
hfenergy: -362.5835037 hartree
pointgroup: C01 [X(C4H9N1O2)]
dipole: -0.8940114 -1.2038388 -0.3468684 debye
dipolederiv: -0.8883168 -0.1561223 -0.1010243 -0.2118421 -0.4790773 0.2096953 -0.1260522 0.1894815 -0.3180039 -0.6674879 0.0916113 0.0309449 -0.0657195 -0.8386639 -0.3113005 -0.0778824 -0.2840847 -0.5692137 -0.9323062 -0.4350007 -0.2825351 -0.2599781 -0.5371353 0.0618156 -0.2156791 0.0413479 -0.7136362 -0.1001105 -0.0110897 -0.0144248 0.132207 -0.0140626 -0.0092513 0.0163505 0.0137129 0.1146434 -0.3611337 0.0902626 0.026157 0.1971295 -0.0239829 -0.0091766 -0.0028061 -0.0101599 0.1751943 0.6408826 0.1707949 0.0037429 0.1173926 0.4621245 -0.0730265 0.0354794 -0.0608007 0.3579998 1.3526052 0.1696114 0.2946355 0.0761489 0.9831277 0.5177202 0.3428088 0.5061485 0.5809733 0.0979162 -0.0085183 -0.004783 -0.0248764 -0.0242081 -0.083101 -0.0366259 -0.1042702 -0.0051836 0.0444543 -0.0011744 -0.0152406 0.003561 0.0239442 0.0917142 -0.0140833 0.102323 -0.0958928 0.0174662 -0.0235135 -0.0219834 -0.0339516 -0.04164 -0.1151717 -0.0082827 -0.1465379 -0.047167 0.076424 0.0350337 -0.0270764 0.0049999 0.0169081 0.0723493 0.0053002 0.1051968 -0.0614982 0.0307148 -0.0130795 0.0108397 0.0036974 -0.0664475 -0.0912688 0.0218618 -0.1319671 -0.0287977 -0.0241108 -0.0419211 0.0102854 -0.0156192 -0.045946 0.1139398 0.0005197 0.168986 -0.172639 0.3475327 0.0555933 0.1153204 0.0099754 0.1677974 -0.156775 0.1064833 -0.1701496 0.164329 0.1532063 0.0344069 -0.0147634 0.0301906 0.2233537 -0.1010025 -0.03957 -0.0997214 0.3193193 0.2122636 0.0431055 -0.0100946 0.0366846 0.1939079 -0.1171606 -0.007822 -0.1195051 0.2995731 unknown
polarizability: 70.028346|3.4535377|55.2901907|2.1370132|7.8838365|45.6938808 unknown
InChI: InChI=1S/C4H9NO2/c5-4(7)2-1-3-6/h6H,1-3,5H2
charge 0 multiplicity 1
16 atoms
O  3.362143 0.369162 -0.163884
O  -1.732166 1.041565 0.974844
N  -2.753295 -0.624824 -0.270994
C  0.870591 0.177753 -0.060529
C  -0.318011 -0.79063 0.13285
C  2.226861 -0.53769 0.063793
C  -1.643311 -0.035195 0.314863
H  0.785133 0.977313 0.701329
H  0.807983 0.667553 -1.050259
H  -0.381114 -1.509163 -0.707086
H  -0.156496 -1.386993 1.055137
H  2.341466 -1.312829 -0.713744
H  2.306886 -1.030094 1.058932
H  3.29987 1.122255 0.476984
H  -3.662413 -0.178135 -0.149555
H  -2.688126 -1.480549 -0.818881
