program: Gaussian 09
title: 000151445
version: EM64L-G09RevD.01
frameworkgroup: C1[X(C6H11N2O2)]
method: RPBEPBE
basis: SDD
operation: Freq
keyword: #p
keyword: freq=noraman
keyword: PBEPBE/SDD
title: #p freq=noraman PBEPBE/SDD
converged: YES YES NO NO
title: Mulliken charges:
elementType: O O N N C C C C C C H H H H H H H H H H H
charge: -0.126905 -0.060245 0.016606 -0.114031 0.214965 -0.677546 -0.613847 -0.706171 -0.146783 0.184069 0.250439 0.234985 0.276518 0.247549 0.243623 0.263435 0.253187 0.283242 0.229017 0.343975 0.403918
chargesum: 1.00000
title: Mulliken charges with hydrogens summed into heavy atoms:
elementType: O O N N C C C C C C
charge: -0.126905 -0.060245 0.016606 0.289887 0.214965 0.084396 0.140760 0.059276 0.197193 0.184069
polarizability: 1.13137525e+02 -9.03713384e+00 8.49284938e+01 5.08125561e-01 -3.70268190e-01 5.79873199e+01
1716.lowfreq: -9.9340 -0.0009 -0.0005 -0.0003 6.1758 15.6889 33.8707 115.2486 177.4490
frequency: 27.9749 115.2310 177.4381 221.5497 226.0646 266.8636 283.7211 308.4231 316.5014 335.4830 379.3370 403.0062 420.1231 499.0928 508.5032 575.5063 599.0560 657.9481 724.8905 778.5701 816.8831 907.0148 920.4114 926.3399 965.8461 1018.3428 1029.0340 1033.4436 1066.9969 1075.6755 1159.5383 1232.7412 1244.5306 1293.3244 1325.0993 1394.4939 1396.9512 1424.5299 1454.8350 1460.2223 1462.4516 1484.2614 1490.5830 1500.8231 1522.5880 1812.7894 2991.6258 3002.3236 3004.3756 3087.5455 3102.5417 3106.2874 3108.1440 3111.7714 3114.3007 3267.9300 3447.4288
redmass: 3.9961 4.1803 2.1682 3.5837 1.4303 1.0501 1.6856 2.1628 2.6225 2.0116 2.5377 2.6040 3.8365 3.0515 2.6396 5.3142 5.5093 3.4409 6.4755 3.2996 1.4974 5.9737 1.8225 1.5846 1.2084 2.8044 1.4264 1.8435 3.2379 2.5044 1.8976 3.0389 2.7484 1.5842 1.7131 1.1700 1.1879 1.1849 1.0497 1.0510 1.0492 1.0485 1.0568 1.1126 4.3470 12.5473 1.0384 1.0367 1.0366 1.1011 1.1010 1.0995 1.1005 1.1016 1.0992 1.1000 1.0819
irintensity: 0.1066 3.4963 2.2382 1.5520 1.2723 0.5726 0.9185 2.4279 4.1415 1.7141 67.1981 13.6416 9.2643 29.3730 7.8219 45.5409 62.8678 13.3842 88.7154 2.6828 31.1431 0.6483 2.0939 2.1558 0.0142 26.5696 0.2361 25.8142 40.3979 11.8048 55.5667 19.1895 7.5637 20.8997 26.1652 26.3093 40.8131 4.0773 0.5845 0.0514 1.8116 28.2296 26.9726 36.4396 4.5280 359.5698 6.7579 3.0343 1.7687 8.5165 6.0364 0.7493 10.4972 8.8874 4.1399 39.4294 144.9951
temp: 298.150 k
press: 1.00000 atm
elementType: 8 8 7 7 6 6 6 6 6 6 1 1 1 1 1 1 1 1 1 1 1
symmnumber: 1
zpe: 446143.1 jmol-1
zpe.correction: 0.169927 hartree
zpe.thermalcorrener: 0.180660 hartree
zpe.thermalcorrenthalpy: 0.181604 hartree
zpe.thermalcorrgfe: 0.133975 hartree
zpe.sumelectzpe: -494.052520 hartree
zpe.sumelectthermal: -494.041787 hartree
zpe.sumelectthermalent: -494.040843 hartree
zpe.sumelectthermalfe: -494.088472 hartree
dipole: 5.6001 -0.0258 -0.9820
dipole: 5.6857
quadrupole: -52.3640 -46.4503 -54.2623
quadrupole: -0.3950 0.1444 2.1515
quadrupole: -1.3384 4.5753 -3.2368 -0.3950 0.1444 2.1515
hfenergy: -494.2224472 hartree
pointgroup: C01 [X(C6H11N2O2)]
dipole: -2.1892924 0.1359069 0.4385154 debye
dipolederiv: -0.3100602 0.2664648 -0.0076148 -0.4391054 -0.25399 0.1165715 0.1243775 0.1500045 -0.1787048 -0.9796948 -0.3007274 0.1297991 -0.1906719 -0.3105597 0.0483451 0.1195734 0.0471719 -0.2359773 -0.2611485 0.129759 0.0376679 0.4012906 0.5300643 -0.1079802 0.1290458 -0.1250557 -0.1055972 0.051748 -0.2954791 0.0173399 -0.480444 -0.7179123 0.1322549 -0.0291237 -0.1314705 0.0278764 0.8314163 -0.0455718 -0.0227353 -0.1782401 0.2563093 0.0156867 -0.1830834 0.0056366 0.2887634 -0.1629187 0.0207759 -0.0057808 0.009068 -0.0757887 -0.0085436 0.0350175 -0.0145208 0.0266905 -0.1629623 0.0084554 -0.008012 0.0728949 -0.0011484 -0.0227575 0.12727 -0.0231132 -0.0187601 -0.1778943 0.0064551 0.0078929 0.0547174 0.0025387 0.0432722 0.0058706 0.0435684 -0.034965 -0.3857814 -0.3801059 0.0757152 0.0977881 -0.0839495 0.0011177 -0.0043681 0.0553247 0.0053976 1.6598049 0.5072357 -0.207081 0.5560388 0.5353088 -0.1500492 -0.2672053 -0.084961 0.3794285 0.0884688 -0.0452527 -0.0816247 -0.0068345 0.0514574 -0.0302735 -0.0755828 -0.0484488 -0.0303231 0.0921723 -0.0668095 0.0858762 -0.030656 0.0377725 0.0403022 0.0775724 0.0642252 -0.0304006 -0.0317952 -0.0029813 0.0018991 -0.0162861 0.1188363 -0.0007109 0.0058524 -0.0050454 0.1325524 0.1060039 0.0739817 -0.0066489 0.0519836 -0.0566175 -0.0234315 -0.0193654 0.0247898 0.0693095 0.0766803 -0.0651018 0.0733308 -0.0653851 0.0318699 0.0771505 0.0390952 0.0371116 -0.00315 -0.0353026 0.021473 0.0159692 0.0011522 0.1234517 -0.0186062 -0.0240217 -0.0163465 0.0966022 0.0876568 -0.0337775 -0.0860348 -0.062777 0.0572009 -0.0431048 -0.0542101 -0.0243335 -0.0393196 -0.0151016 0.0257736 -0.0087197 0.0494885 0.1257208 0.0075366 -0.0225892 0.0131142 0.1220485 0.1203338 0.0907415 0.0047441 0.0672723 -0.0866219 -0.0033895 0.0276745 -0.0318718 0.0590459 0.1505847 0.0328507 -0.0206773 0.0225346 0.2192381 -0.0050895 -0.0407327 0.0099757 0.1927161 0.2577897 0.0518406 0.0046948 0.086171 0.4968192 -0.068301 0.0289332 0.0542447 0.2767666 unknown
polarizability: 113.0510175|8.1841886|82.0576267|-4.2691763|-8.3949993|60.9446949 unknown
InChI: InChI=1S/C6H11N2O2/c1-6(2,3)8-4-5(9)10-7-8/h4,7H,1-3H3
charge 1 multiplicity 1
21 atoms
O  1.85035 -1.128119 0.375077
O  3.304378 0.676141 -0.318715
N  -0.118451 -0.003632 0.092851
N  0.439622 -1.238698 0.37401
C  -1.672306 0.134841 0.045812
C  -2.002595 1.635929 0.165157
C  -2.114261 -0.450775 -1.320716
C  -2.249018 -0.671483 1.233457
C  0.819733 0.874763 -0.261948
C  2.160502 0.303916 -0.13066
H  -1.600588 2.08441 1.090165
H  -1.662777 2.216713 -0.709638
H  -3.100367 1.73461 0.199474
H  -1.840084 -1.514299 -1.421933
H  -1.684198 0.114448 -2.164951
H  -3.212849 -0.372469 -1.386554
H  -1.854326 -0.329547 2.206862
H  -3.33935 -0.509978 1.252143
H  -2.108397 -1.762746 1.123446
H  0.596661 1.878555 -0.610276
H  0.058621 -1.794578 1.155739
