program: Gaussian 09
title: 000151444
version: EM64L-G09RevD.01
frameworkgroup: C1[X(C6H10N2O2)]
method: RPBEPBE
basis: SDD
operation: Freq
keyword: #p
keyword: freq=noraman
keyword: PBEPBE/SDD
title: #p freq=noraman PBEPBE/SDD
converged: NO NO NO NO
title: Mulliken charges:
elementType: O O N N C C C C C C H H H H H H H H H H
charge: -0.213637 -0.208338 -0.062037 0.027422 0.264111 -0.659983 -0.659818 -0.692334 -0.293356 0.119047 0.224904 0.224616 0.240756 0.224756 0.224861 0.240728 0.211493 0.241981 0.242079 0.302747
chargesum: 0.00000
title: Mulliken charges with hydrogens summed into heavy atoms:
elementType: O O N N C C C C C C
charge: -0.213637 -0.208338 -0.062037 0.027422 0.264111 0.030293 0.030528 0.003219 0.009391 0.119047
polarizability: 1.13331686e+02 6.65223790e+00 8.51608180e+01 -2.21029809e-03 -2.19433935e-03 5.89732285e+01
1716.lowfreq: -25.9694 -10.1113 -0.0005 -0.0004 0.0003 11.5398 32.0982 107.1783 180.8500
frequency: 29.0398 107.1387 180.8309 188.9834 247.8419 248.0281 268.4073 308.5821 330.2762 343.6360 417.2896 440.6729 485.0166 538.3055 551.1430 604.1433 642.7125 697.4388 730.5966 808.5522 905.3618 924.8141 933.5190 958.6045 988.3764 1032.4539 1032.8258 1074.4971 1105.2922 1204.5570 1231.0286 1239.4118 1311.3212 1385.4341 1390.8482 1412.5035 1423.0680 1452.5046 1463.4168 1463.6482 1477.1105 1479.2672 1495.6953 1777.5621 2995.4425 2997.8519 3008.1469 3094.5340 3099.5122 3101.4707 3102.7848 3109.3655 3116.9751 3278.1695
redmass: 4.2950 4.1224 1.0553 3.6966 1.1642 1.3517 1.9124 2.7463 3.2054 2.8233 4.0771 3.9096 6.1143 3.2198 5.3411 7.9024 1.5630 3.2802 10.2512 3.0171 6.9462 1.6672 1.6257 1.2049 5.3623 1.4000 1.5268 2.9038 3.4443 2.3400 2.7648 3.1123 3.0852 1.1902 1.2228 1.8382 2.1843 1.0468 1.0472 1.0519 1.0544 1.0573 1.0692 12.0447 1.0353 1.0357 1.0365 1.1007 1.0999 1.1010 1.1009 1.0995 1.1005 1.0979
irintensity: 1.5629 1.9237 0.0935 0.4660 0.2334 0.4637 0.0367 0.9447 5.9073 0.5005 4.7760 0.3398 13.9020 18.9638 7.2726 1.3154 25.4050 37.9549 17.3949 1.2150 21.4662 1.9209 3.1921 0.2206 14.7630 0.5462 2.7978 29.1747 13.2828 86.6613 13.6617 17.5949 2.3371 23.4325 37.9211 10.3046 16.8707 0.1017 0.7888 0.1557 11.6956 19.9606 26.0771 566.9320 14.3389 12.2681 9.2953 0.7415 31.9989 7.6154 7.8428 52.7291 19.9478 4.3515
temp: 298.150 k
press: 1.00000 atm
elementType: 8 8 7 7 6 6 6 6 6 6 1 1 1 1 1 1 1 1 1 1
symmnumber: 1
zpe: 414123.3 jmol-1
zpe.correction: 0.157731 hartree
zpe.thermalcorrener: 0.168177 hartree
zpe.thermalcorrenthalpy: 0.169121 hartree
zpe.thermalcorrgfe: 0.121914 hartree
zpe.sumelectzpe: -493.741753 hartree
zpe.sumelectthermal: -493.731308 hartree
zpe.sumelectthermalent: -493.730363 hartree
zpe.sumelectthermalfe: -493.777570 hartree
dipole: 7.6167 -2.1770 0.0000
dipole: 7.9218
quadrupole: -73.3663 -61.1414 -58.2174
quadrupole: -0.7094 0.0010 0.0018
quadrupole: -9.1246 3.1003 6.0243 -0.7094 0.0010 0.0018
hfenergy: -493.8994844 hartree
pointgroup: C01 [X(C6H10N2O2)]
dipole: -2.990953 -0.8762212 -0.0010502 debye
dipolederiv: -0.635686 -0.2947824 -0.0006198 0.5427091 -0.2858652 -0.0005678 0.00165 -0.0002526 -0.14457 -1.4922679 0.3304435 0.00132 0.3488368 -0.4064864 -0.0003567 0.0013642 -0.0003605 -0.3168198 -0.2638903 -0.3035096 -0.0005526 -0.4652557 0.3100391 0.0012082 -0.0005742 0.0012312 -0.0827085 0.2137335 0.3466307 0.0007904 0.4494761 -0.2796539 -0.0005869 0.0007287 -0.0005288 -0.0863477 0.7677705 0.0505602 -0.0000147 0.0170103 0.217038 -0.0003548 -0.0007165 -0.0003941 0.3193765 -0.079114 -0.0112284 -0.0124136 -0.0111438 0.0000686 0.0527853 -0.0201634 0.0492956 -0.0573399 -0.0792199 -0.011306 0.0122539 -0.0114049 0.0008618 -0.0522152 0.0203336 -0.0487008 -0.0582532 -0.0513896 0.0326554 0.0001311 0.0640307 -0.0829266 -0.0003334 0.0004739 -0.0003623 0.0067405 -0.6218995 0.4007503 0.0011387 -0.2245913 -0.2117456 0.0000634 -0.0004914 -0.0003 -0.2519242 2.0218571 -0.4865816 -0.0019625 -0.6393976 0.4340613 0.0007093 -0.0023644 0.0007352 0.2347566 -0.1465261 -0.0410013 0.0138925 -0.030816 0.10312 0.0107682 0.0011091 0.0068012 0.0912594 0.0614004 0.1183895 0.0004057 0.0918884 -0.0872512 0.0269536 0.0184365 -0.0163059 0.0676722 0.1011702 -0.0327325 -0.0552804 -0.0320929 0.0248163 -0.0998151 -0.0390106 -0.0546245 -0.0659581 0.0612562 0.1184025 0.0006932 0.0920842 -0.086915 -0.0285565 -0.0175704 0.0147529 0.0676317 -0.1465225 -0.0410251 -0.013947 -0.0310896 0.1031785 -0.010688 -0.0012227 -0.0066738 0.0910421 0.1013132 -0.0332045 0.0546839 -0.0322347 0.0233302 0.1008123 0.0384503 0.055447 -0.0645647 -0.1530349 -0.0151515 0.000033 -0.0805773 0.0896816 -0.0000711 -0.0002004 -0.0001196 0.1080939 0.1133513 -0.0364504 -0.0517 -0.0021233 0.0321261 -0.0712786 -0.052242 -0.0848036 -0.0491371 0.1136858 -0.0369058 0.0512195 -0.0025663 0.030847 0.0718653 0.0520665 0.0854598 -0.047708 0.1140126 -0.0539529 -0.0000714 -0.0427424 0.071675 -0.0003416 -0.000057 -0.0002965 0.2387583 unknown
polarizability: 113.4180683|-6.4660754|85.0742473|-0.0378689|0.0686363|58.973417 unknown
InChI: InChI=1S/C6H10N2O2/c1-6(2,3)8-4-5(9)10-7-8/h4H,1-3H3
charge 0 multiplicity 1
20 atoms
O  1.739742 1.199563 0.00254
O  3.285164 -0.667211 -0.00279
N  -0.150542 0.07769 0.000683
N  0.327251 1.361626 0.003616
C  -1.658174 -0.131319 0.000426
C  -2.018612 -0.932416 1.276166
C  -2.019675 -0.920843 -1.28223
C  -2.360798 1.242789 0.00688
C  0.804235 -0.89836 -0.002246
C  2.101225 -0.301315 -0.001363
H  -3.110693 -1.088598 1.308608
H  -1.532344 -1.922935 1.291422
H  -1.718966 -0.381563 2.184018
H  -1.532473 -1.910687 -1.307266
H  -3.11166 -1.077692 -1.314742
H  -1.72167 -0.361229 -2.185247
H  -3.451364 1.071667 0.00661
H  -2.097992 1.831016 0.900934
H  -2.098811 1.838873 -0.88218
H  0.579458 -1.957656 -0.004539
