program: Gaussian 09
title: 000151438
version: EM64L-G09RevD.01
frameworkgroup: C1[X(C4H12NO4P)]
method: RPBEPBE
basis: SDD
operation: Freq
keyword: #p
keyword: freq=noraman
keyword: PBEPBE/SDD
title: #p freq=noraman PBEPBE/SDD
converged: YES YES NO NO
title: Mulliken charges:
elementType: P O O O O N C C C C H H H H H H H H H H H H
charge: 1.389398 -0.524196 -0.683359 -0.677618 -0.588666 -0.099860 -0.349428 -0.241929 -0.613279 -0.613832 0.204922 0.229969 0.256783 0.224904 0.223601 0.230713 0.192452 0.228452 0.193484 0.220326 0.403148 0.394015
chargesum: 0.00000
title: Mulliken charges with hydrogens summed into heavy atoms:
elementType: P O O O O N C C C C
charge: 1.389398 -0.524196 -0.280211 -0.283604 -0.588666 -0.099860 0.085463 0.239758 0.033488 0.028430
polarizability: 1.14856350e+02 -2.27128411e-01 7.83349430e+01 -4.29641906e+00 9.17531549e-01 7.57925335e+01
1716.lowfreq: -18.9766 -8.1811 -3.1534 0.0010 0.0018 0.0020 14.0539 29.8227 62.7045
frequency: 5.3249 29.7585 62.6277 86.9000 95.3033 157.3681 185.7259 212.5545 222.6190 235.8844 244.5410 290.2929 330.2392 349.1903 359.8799 378.5372 389.1664 443.0500 454.2490 634.1632 722.8806 737.1807 796.7783 828.1548 930.6737 1001.5207 1013.8924 1033.3543 1037.8686 1057.4326 1080.6940 1089.8526 1096.2678 1136.5518 1158.2657 1240.6161 1269.2882 1288.2486 1322.2023 1378.5211 1421.6105 1443.6002 1460.9387 1468.7698 1471.9589 1476.0525 1484.5088 1486.8361 2855.6662 2866.3787 2902.7111 3013.3995 3021.6059 3026.5410 3055.4694 3079.4768 3083.5513 3105.6272 3592.3600 3613.4521
redmass: 3.1509 4.9000 2.5657 3.4990 3.4444 1.8366 1.8779 1.1322 3.8123 1.4368 2.4807 2.4769 3.4180 4.0633 4.4623 1.7636 2.9573 2.6658 4.0143 12.1001 10.7501 7.9252 1.1899 3.7733 8.7257 1.3513 1.2348 2.2521 1.5624 1.6170 2.9088 1.3956 4.1494 1.4055 1.3375 1.7640 2.5344 1.2681 1.3308 1.3744 1.1396 1.1558 1.0468 1.0712 1.0708 1.0554 1.0861 1.0535 1.0565 1.0569 1.0693 1.0605 1.0737 1.0725 1.0898 1.1007 1.1007 1.1071 1.0661 1.0665
irintensity: 1.2417 0.3616 3.2945 0.4110 1.3129 83.8729 14.7263 2.3165 6.2481 11.9618 26.4336 36.4627 7.3998 34.3326 61.6242 107.6375 29.6345 17.0062 7.5297 29.9379 247.3383 184.9174 3.1837 4.8628 226.2878 26.5158 118.6036 69.2277 18.9110 10.0075 21.6909 30.8349 183.2603 1.3557 3.0496 5.5224 12.3647 3.7368 1.6791 0.8353 2.6065 3.2758 9.4508 5.1704 14.6643 13.2223 25.2906 9.4338 72.0202 169.4242 97.4701 15.6176 37.5260 56.8834 9.3340 20.3556 51.3236 26.5852 61.1804 67.4493
temp: 298.150 k
press: 1.00000 atm
elementType: 15 8 8 8 8 7 6 6 6 6 1 1 1 1 1 1 1 1 1 1 1 1
symmnumber: 1
zpe: 450502.5 jmol-1
zpe.correction: 0.171587 hartree
zpe.thermalcorrener: 0.185464 hartree
zpe.thermalcorrenthalpy: 0.186409 hartree
zpe.thermalcorrgfe: 0.128193 hartree
zpe.sumelectzpe: -855.616118 hartree
zpe.sumelectthermal: -855.602240 hartree
zpe.sumelectthermalent: -855.601296 hartree
zpe.sumelectthermalfe: -855.659512 hartree
dipole: -2.1687 2.8459 0.7035
dipole: 3.6466
quadrupole: -64.1060 -68.6864 -68.3447
quadrupole: 9.4893 8.3030 -4.9002
quadrupole: 2.9397 -1.6407 -1.2990 9.4893 8.3030 -4.9002
hfenergy: -855.7877049 hartree
pointgroup: C01 [X(C4H12N1O4P1)]
dipole: -0.8478515 1.1531249 0.0986542 debye
dipolederiv: 2.3886207 -0.0476167 -0.0896283 0.3014969 1.8502556 -0.1786697 0.2968935 -0.0530657 1.855589 -1.6814084 0.0733825 0.1021574 0.1561615 -0.4940117 0.0210516 0.1696066 0.0194288 -0.4812551 -0.5794308 0.1441955 -0.0345384 0.0975632 -0.600856 -0.0457216 -0.2204756 -0.0224976 -1.1155246 -0.7730408 -0.0823363 -0.0773231 -0.2452712 -1.0921471 0.2287972 -0.0874755 0.1370415 -0.4775118 -0.7995727 0.0592768 0.0302835 -0.0071978 -0.6434954 0.0025463 0.0216927 -0.0229408 -0.6231434 -0.7976568 -0.0466091 -0.0742145 -0.0086466 -0.5027744 0.0098543 0.0226603 0.0172702 -0.5627257 0.513947 -0.1103097 -0.0822772 -0.023359 0.1258534 0.0143004 0.088386 0.0127801 0.3814692 0.880451 -0.0740619 -0.0654938 -0.4080592 0.2917693 -0.031686 -0.4282948 -0.057031 0.2514064 0.3981686 0.2037131 0.0647186 0.2999751 0.2217798 0.0600383 0.0258449 0.0419964 0.3356655 0.0906184 -0.0887686 0.1053418 -0.158691 0.3488131 -0.0940664 0.1339076 -0.0715033 0.4112996 -0.0336578 0.0199464 0.0031941 -0.0003323 0.0642662 0.0608333 0.0815243 -0.0142102 -0.2285384 0.0581427 -0.0081821 0.0045531 0.0054565 -0.1279261 0.0148558 0.0028234 0.0430116 0.0722988 0.0038405 0.0127767 0.0016226 0.0464503 0.0606628 0.0395935 0.0411388 0.0188696 -0.0799696 0.0165631 -0.0156946 0.0192339 0.0505736 -0.1281463 -0.0054033 0.0462997 0.0280705 0.0605385 -0.1309904 0.0317393 0.0886516 0.1108106 0.0504841 -0.0797045 0.0942769 -0.0614616 0.0296302 0.087717 0.0639363 -0.0513999 -0.0100778 -0.1222862 0.1028539 -0.0417359 0.090406 0.0444901 -0.0813969 -0.0966374 -0.0441389 -0.1124816 0.0084643 -0.024118 -0.211141 -0.1286317 -0.2207848 -0.0932382 0.1414663 0.0826545 0.0813006 0.0454439 -0.0251047 0.1045097 -0.0470232 0.0153237 0.032137 0.0510695 -0.0773628 0.0231967 -0.0169483 -0.0469004 -0.1464415 0.1202817 -0.2716244 -0.0402343 -0.1729664 -0.024173 -0.1349188 -0.0204372 0.0055489 -0.0366851 0.0104096 0.0705011 0.1912309 -0.1019517 0.0250234 -0.1012977 0.3490085 -0.0175193 -0.0366578 -0.0119862 0.3566547 0.3491904 0.0436322 0.0931155 0.0373477 0.3322278 -0.0113793 0.0793427 -0.0492147 0.176211 unknown
polarizability: 115.1018656|-1.1056184|78.5427613|-2.7470428|0.557127|75.3391992 unknown
InChI: InChI=1S/C4H12NO4P/c1-5(2)3-4-9-10(6,7)8/h6-7H,3-4H2,1-2H3
charge 0 multiplicity 1
22 atoms
P  2.502029 -0.110499 0.035114
O  0.91583 -0.565705 -0.367851
O  2.386517 -0.107428 1.74664
O  2.61923 1.607895 -0.215839
O  3.628054 -0.957737 -0.679995
N  -2.724209 0.095554 0.149629
C  -1.492057 -0.497931 -0.417428
C  -0.262961 0.069067 0.306022
C  -3.886712 -0.81394 0.115685
C  -3.041468 1.426602 -0.405802
H  -1.389876 -0.325989 -1.515519
H  -1.509444 -1.590496 -0.259534
H  -0.264846 -0.208926 1.372179
H  -0.186322 1.16772 0.208066
H  -4.730596 -0.352998 0.66036
H  -3.63549 -1.762623 0.62135
H  -4.237747 -1.053048 -0.919916
H  -3.887232 1.868315 0.15068
H  -3.318915 1.392924 -1.490126
H  -2.179118 2.107029 -0.296853
H  3.152113 0.293271 2.22862
H  3.049519 1.854945 -1.074182
