program: Gaussian 09
title: 000151437
version: EM64L-G09RevD.01
frameworkgroup: C1[X(C11H13NO7)]
method: RPBEPBE
basis: SDD
operation: Freq
keyword: #p
keyword: freq=noraman
keyword: PBEPBE/SDD
title: #p freq=noraman PBEPBE/SDD
converged: YES YES NO NO
title: Mulliken charges:
elementType: O O O O O O O N C C C C C C C C C C C H H H H H H H H H H H H H
charge: -0.222892 -0.307770 -0.439710 -0.442907 -0.418312 -0.212234 -0.214626 0.022350 -0.145062 -0.234315 -0.098792 -0.104524 -0.340894 0.385225 -0.290259 -0.360588 -0.358091 -0.334404 0.378163 0.276224 0.277588 0.256357 0.272618 0.189549 0.267137 0.361734 0.357936 0.333621 0.305331 0.262516 0.288715 0.290312
chargesum: 0.00000
title: Mulliken charges with hydrogens summed into heavy atoms:
elementType: O O O O O O O N C C C C C C C C C C C
charge: -0.222892 -0.307770 -0.077976 -0.084971 -0.084690 -0.212234 -0.214626 0.022350 0.131162 0.043274 0.157565 0.168095 0.115791 0.385225 0.015073 -0.098071 -0.069375 -0.044092 0.378163
polarizability: 2.35459418e+02 -7.36214349e+00 1.44616239e+02 8.86495761e+00 1.20411852e+01 1.00113629e+02
1716.lowfreq: -10.0109 -4.5822 -0.0010 -0.0006 0.0006 6.6332 32.1426 39.0045 55.6548
frequency: 31.6243 38.9350 55.6373 70.4072 82.5148 90.8085 106.5018 139.3065 167.0267 186.4186 201.5951 217.4417 240.9487 260.5112 287.1019 311.6454 322.6458 352.1822 378.6776 413.5175 416.8109 464.3351 484.8427 500.5526 505.7750 534.7395 578.3711 626.8861 632.4667 665.5034 710.6949 731.4211 753.6895 771.5557 784.5145 807.6033 833.9381 860.1002 865.8104 904.6641 947.5825 955.5149 980.7168 987.9063 990.8405 997.5612 1004.4154 1016.7346 1036.7236 1055.0129 1071.3346 1095.4032 1112.0138 1151.8074 1169.9883 1176.0001 1200.8870 1212.9882 1224.7315 1235.0016 1264.9792 1281.6953 1281.7540 1295.0584 1302.9321 1328.1613 1348.6001 1357.5701 1369.5777 1383.7287 1391.4734 1403.0942 1430.6023 1458.7381 1476.5523 1592.0801 1608.1513 2948.5761 3024.5988 3048.4603 3057.3822 3103.8891 3111.7664 3165.5785 3172.3439 3187.5239 3190.3296 3486.4602 3553.7616 3577.9454
redmass: 6.3026 6.9699 7.4856 7.8714 5.9456 4.1721 4.3512 5.3562 6.0257 4.4764 5.9224 1.4873 2.3161 4.2048 2.0127 4.0804 4.2502 6.4929 3.9798 5.6279 3.0270 4.3817 1.2969 2.7535 5.8858 3.8006 5.8715 8.8817 6.8377 4.6965 5.9521 5.0307 8.7580 4.2877 4.0670 7.5119 1.2505 1.6714 6.8582 2.7667 2.9476 4.1041 1.3301 1.3524 1.9225 3.0541 4.9169 3.9411 3.5471 2.4652 2.0784 3.1626 1.2561 1.3028 1.4863 1.2939 1.5973 2.0537 5.7212 1.3974 1.2850 1.4145 1.3775 1.2916 1.3098 1.2323 1.3254 7.8333 1.3189 1.2760 1.3062 8.7474 4.0466 1.0811 2.4015 7.7534 6.6037 1.0700 1.0861 1.0863 1.0897 1.0884 1.0932 1.0896 1.0892 1.0962 1.0974 1.0659 1.0663 1.0669
irintensity: 0.4406 0.3800 1.5129 1.4131 0.7576 5.5792 8.2738 15.8681 4.1427 7.5430 2.8885 112.1642 56.7907 30.7711 94.0952 38.1100 28.3204 6.2777 11.4683 1.6225 0.4582 13.4592 116.3810 5.7855 11.7134 11.7710 9.4951 14.6536 4.6626 20.8427 9.0234 11.8795 34.5817 54.7026 29.2748 6.8550 2.1912 67.4220 514.9791 56.5573 25.9069 105.5138 1.4728 0.8108 25.0025 2.7479 92.4024 47.6892 189.4326 1.0525 67.5683 25.1067 26.6832 35.5014 250.9447 59.4615 87.5988 109.5761 310.9180 10.6163 13.9608 1.0668 10.1371 1.3350 6.0527 2.5955 15.3306 87.5797 26.6849 9.4747 17.0785 29.4789 18.7838 6.0738 86.4477 40.8793 187.5619 60.7488 24.2976 15.3203 21.7967 15.8963 7.1572 1.7645 0.2235 0.5453 4.0503 68.6783 6.3560 15.9015
temp: 298.150 k
press: 1.00000 atm
elementType: 8 8 8 8 8 8 8 7 6 6 6 6 6 6 6 6 6 6 6 1 1 1 1 1 1 1 1 1 1 1 1 1
symmnumber: 1
zpe: 623351.6 jmol-1
zpe.correction: 0.237422 hartree
zpe.thermalcorrener: 0.255511 hartree
zpe.thermalcorrenthalpy: 0.256455 hartree
zpe.thermalcorrgfe: 0.190147 hartree
zpe.sumelectzpe: -1006.726711 hartree
zpe.sumelectthermal: -1006.708622 hartree
zpe.sumelectthermalent: -1006.707678 hartree
zpe.sumelectthermalfe: -1006.773987 hartree
dipole: 4.9658 -2.9507 1.2665
dipole: 5.9136
quadrupole: -151.1384 -115.3501 -101.3553
quadrupole: 3.2567 0.8485 -10.6112
quadrupole: -28.5238 7.2644 21.2593 3.2567 0.8485 -10.6112
hfenergy: -1006.9641334 hartree
pointgroup: C01 [X(C11H13N1O7)]
dipole: 2.0535019 -1.0723114 -0.2149795 debye
polarizability: 236.2277996|-2.9863426|115.8981859|5.276514|24.7345795|128.0633005 unknown
InChI: InChI=1S/C11H13NO7/c13-5-8-9(14)10(15)11(19-8)18-7-3-1-6(2-4-7)12(16)17/h1-4,8-11,13-15H,5H2
charge 0 multiplicity 1
32 atoms
O  1.820166 0.710293 0.721441
O  0.623897 -0.9667 -0.57351
O  2.925465 -0.212384 -2.230482
O  3.890001 -1.453679 1.112428
O  3.605431 2.963308 1.496247
O  -5.314539 0.774591 1.072698
O  -5.714737 -0.450074 -0.811922
N  -4.918026 0.060909 0.06982
C  3.462306 -0.128616 -0.873995
C  2.936525 -1.284648 0.017562
C  2.9952 1.148692 -0.11923
C  1.603876 -0.693862 0.531339
C  4.066352 1.767283 0.790986
C  -0.730771 -0.660449 -0.352668
C  -1.19439 0.135958 0.72708
C  -1.636254 -1.203475 -1.300132
C  -2.575582 0.366425 0.864413
C  -3.012819 -0.966797 -1.166705
C  -3.469831 -0.186643 -0.078273
H  4.554918 -0.182546 -0.984493
H  2.783735 -2.211406 -0.563876
H  2.611897 1.893153 -0.842663
H  1.205626 -1.117244 1.469688
H  4.962395 1.987952 0.168888
H  4.34432 1.052794 1.580197
H  1.94031 -0.343123 -2.169757
H  3.685404 -2.275788 1.623729
H  3.330924 3.651372 0.837747
H  -0.491441 0.602266 1.421316
H  -1.243978 -1.811242 -2.120562
H  -2.96968 0.977541 1.68063
H  -3.736899 -1.374562 -1.876441
