program: Gaussian 09
title: 000151434
version: EM64L-G09RevD.01
frameworkgroup: C1[X(C7H9N5O8P2)]
method: RPBEPBE
basis: SDD
operation: Freq
keyword: #p
keyword: freq=noraman
keyword: PBEPBE/SDD
title: #p freq=noraman PBEPBE/SDD
converged: YES YES NO NO
title: Mulliken charges:
elementType: P P O O O O O O O O N N N N N C C C C C C C H H H H H H H H H
charge: 1.465539 1.423979 -0.507716 -0.791942 -0.689737 -0.533893 -0.187046 -0.636853 -0.649760 -0.577620 0.066916 -0.412660 -0.016727 -0.034903 -0.612222 0.256087 -0.434478 -0.167123 0.180624 -0.383180 0.005402 0.155912 0.248649 0.290061 0.304792 0.327994 0.411682 0.362412 0.319618 0.403845 0.412348
chargesum: 0.00000
title: Mulliken charges with hydrogens summed into heavy atoms:
elementType: P P O O O O O O O O N N N N N C C C C C C C
charge: 1.465539 1.423979 -0.507716 -0.791942 -0.278055 -0.533893 -0.187046 -0.233008 -0.237412 -0.577620 0.066916 -0.084667 -0.016727 -0.034903 0.069809 0.256087 0.104232 -0.167123 0.180624 -0.078388 0.005402 0.155912
polarizability: 2.93811880e+02 1.46167812e+00 1.85653529e+02 -2.69115202e+00 8.84550468e+00 1.15290256e+02
1716.lowfreq: -7.5903 -6.0744 0.0008 0.0012 0.0019 2.4832 13.8126 19.2154 20.9899
frequency: 12.4394 19.1406 20.9043 29.8985 42.7544 51.1060 69.0336 106.1692 115.2060 139.1112 148.7531 158.0643 169.6480 187.3045 199.0477 216.9856 234.9117 251.6013 278.8005 297.9084 305.9214 312.0955 323.1521 327.7839 347.3788 351.9500 363.3853 386.2422 407.3060 423.5265 444.0439 462.9776 473.5730 520.1324 546.2120 551.7854 571.0587 603.1090 633.5295 639.6770 658.1685 695.4046 697.8650 701.5397 713.1354 751.8021 759.2841 817.6164 819.5668 821.1337 889.5758 917.7675 949.2891 971.6382 989.2318 1010.3928 1018.7850 1025.2382 1026.8962 1073.4557 1097.3892 1115.9970 1179.0375 1210.2172 1250.2384 1274.2307 1279.6345 1337.8318 1362.4293 1364.6058 1438.5472 1445.8052 1457.8116 1513.9386 1539.2227 1591.7077 1601.1320 1645.9136 3032.3098 3132.5892 3157.1795 3507.3435 3547.9528 3589.9359 3599.4731 3608.7914 3699.6279
redmass: 8.2334 8.7495 8.1917 8.1804 6.6010 9.3383 7.1767 9.8152 8.6338 1.8275 5.9469 4.4605 2.0480 3.2963 5.5513 2.6862 3.3632 3.7003 2.6297 3.2411 1.4927 2.4677 4.2682 2.9844 6.9124 6.4137 4.7345 8.4402 9.4264 7.3364 7.4087 7.1771 7.7067 9.5895 4.6538 1.3580 3.4409 5.5385 1.5511 5.7037 8.6149 7.1795 9.2912 9.6199 10.4337 6.4146 7.2299 10.8936 10.4402 7.3835 7.9890 5.0774 1.6134 2.5975 1.9455 1.2963 1.2983 2.7884 1.3505 4.6462 14.0981 4.6280 3.0981 1.3595 2.5952 4.1148 2.5858 2.0221 2.1930 2.0679 1.2584 3.7474 3.4845 7.9339 4.4225 2.6925 2.5363 3.0033 1.0623 1.1043 1.0950 1.0777 1.0456 1.0664 1.0663 1.0668 1.1054
irintensity: 3.0683 4.6821 1.5088 0.9098 3.3537 2.7007 1.8943 1.6927 6.1375 98.4329 1.3035 10.0290 38.8194 26.4420 13.8797 22.9647 24.4289 21.1251 51.6436 85.3044 29.7292 48.2920 15.0834 41.1984 79.4745 143.1611 9.0276 34.9708 11.5082 18.7650 7.6334 5.4200 1.8881 67.6731 27.9499 229.1267 12.4376 2.8988 90.6900 12.7125 149.9801 33.8207 14.3817 55.7140 82.1994 10.5336 280.4862 664.1379 62.5672 210.7954 164.1922 46.7061 2.9507 14.7759 4.4063 39.8349 100.3401 70.9451 49.7401 152.7216 244.4186 12.1567 61.2697 2.5655 40.6880 4.1860 3.3460 7.1503 43.7246 199.5603 49.4706 270.3192 14.4456 67.5839 34.8167 397.8450 327.2575 490.0935 7.2981 0.4044 0.5355 33.8112 158.9067 105.3460 93.1413 95.9538 49.1648
temp: 298.150 k
press: 1.00000 atm
elementType: 15 15 8 8 8 8 8 8 8 8 7 7 7 7 7 6 6 6 6 6 6 6 1 1 1 1 1 1 1 1 1
symmnumber: 1
zpe: 506213.6 jmol-1
zpe.correction: 0.192807 hartree
zpe.thermalcorrener: 0.216339 hartree
zpe.thermalcorrenthalpy: 0.217284 hartree
zpe.thermalcorrgfe: 0.135980 hartree
zpe.sumelectzpe: -1828.497887 hartree
zpe.sumelectthermal: -1828.474354 hartree
zpe.sumelectthermalent: -1828.473410 hartree
zpe.sumelectthermalfe: -1828.554714 hartree
dipole: -1.4689 -5.9655 -5.2908
dipole: 8.1078
quadrupole: -88.3923 -153.4033 -140.1087
quadrupole: 47.5849 -5.9002 9.2746
quadrupole: 38.9092 -26.1018 -12.8073 47.5849 -5.9002 9.2746
hfenergy: -1828.6906937 hartree
pointgroup: C01 [X(C7H9N5O8P2)]
dipole: 0.5128427 -2.8156407 1.4086893 debye
polarizability: 293.277287|-4.5991751|185.7192622|-7.9658358|9.6732122|115.7591158 unknown
InChI: InChI=1S/C7H9N5O8P2/c8-7-11-5-4(6(13)12-7)10-3(1-9-5)2-19-22(17,18)20-21(14,15)16/h1,11,14-15,17H,2,8H2
charge 0 multiplicity 1
31 atoms
P  -3.086423 -1.094951 -0.812268
P  -4.864206 1.123638 0.635809
O  -1.785742 -0.005085 -0.892067
O  -4.19471 -0.426876 0.369858
O  -2.419167 -2.32369 0.198517
O  -3.707684 -1.528848 -2.189409
O  3.562994 2.786893 -0.005855
O  -6.355012 0.738649 1.38244
O  -5.346204 1.486639 -0.953601
O  -3.93505 2.14232 1.416819
N  1.347165 0.937095 0.136422
N  4.27728 -1.269552 -0.117441
N  2.006217 -1.84282 0.123096
N  5.071589 1.008248 -0.208732
N  6.57293 -0.768199 -0.383636
C  0.388566 -0.027785 0.23809
C  -1.040203 0.440447 0.346537
C  2.645388 0.533288 0.033033
C  2.951565 -0.86352 0.014349
C  0.722276 -1.414108 0.23868
C  3.766721 1.547597 -0.059018
C  5.286494 -0.301146 -0.235145
H  -1.547855 0.046518 1.244876
H  -1.079043 1.539052 0.336325
H  -0.057749 -2.176496 0.325845
H  4.45519 -2.27814 -0.127236
H  -3.047942 -3.042092 0.463165
H  7.300478 -0.061109 -0.466677
H  6.815345 -1.754272 -0.432874
H  -6.333355 0.755456 2.373829
H  -5.603954 2.425349 -1.13483
