program: Gaussian 09
title: 000151433
version: EM64L-G09RevD.01
frameworkgroup: C1[X(C7H13NO4S)]
method: RPBEPBE
basis: SDD
operation: Freq
keyword: #p
keyword: freq=noraman
keyword: PBEPBE/SDD
title: #p freq=noraman PBEPBE/SDD
converged: YES YES NO NO
title: Mulliken charges:
elementType: S O O O O N C C C C C C C H H H H H H H H H H H H H
charge: 0.137418 -0.415801 -0.243458 -0.430657 -0.231397 -0.620300 -0.100083 -0.698827 -0.701427 -0.099383 -0.694892 0.202363 0.236230 0.255471 0.311059 0.251603 0.248413 0.320263 0.244646 0.229194 0.224918 0.239976 0.301180 0.279116 0.374990 0.379385
chargesum: 0.00000
title: Mulliken charges with hydrogens summed into heavy atoms:
elementType: S O O O O N C C C C C C C
charge: 0.137418 -0.040811 -0.243458 -0.051273 -0.231397 -0.040004 0.155387 -0.136164 -0.132751 0.145263 -0.000804 0.202363 0.236230
polarizability: 1.39642721e+02 1.08378001e+01 1.08782853e+02 4.28972921e+00 6.12528017e-01 8.74573726e+01
1716.lowfreq: -3.1640 -0.0024 -0.0022 -0.0011 4.2866 15.4963 29.5860 37.6720 49.5851
frequency: 29.4554 37.6712 49.3755 54.3370 64.4992 109.4759 136.4502 175.8813 205.2387 217.1632 242.0968 246.9183 260.6843 273.0830 307.8949 357.2796 386.2647 460.0022 467.4474 539.2775 565.6816 569.5778 605.3427 625.5068 676.4641 685.5856 716.5009 731.4705 745.6043 763.5052 869.6526 921.0334 936.7666 993.9887 1032.8127 1042.9518 1046.3822 1058.4885 1092.7114 1138.7909 1162.8745 1195.1903 1213.7281 1245.4451 1250.3200 1257.4532 1265.3779 1291.7858 1305.9555 1366.7358 1385.3919 1389.3931 1430.2045 1449.0316 1473.9796 1481.5681 1626.2088 1661.0737 1678.1357 2885.8583 2988.8017 3032.5607 3033.9282 3039.9386 3089.5494 3098.8928 3121.5046 3123.9294 3467.3042 3510.7675 3515.9684 3601.6756
redmass: 5.2424 7.7554 5.3014 9.6433 5.3694 5.5239 6.5077 3.8135 3.8829 1.2379 2.6795 1.3744 2.8912 2.5318 2.3241 3.3683 5.0799 4.1021 4.1457 3.6715 3.3684 1.3047 1.3155 1.3991 3.9714 4.0884 4.0326 4.2196 2.8279 2.8347 1.5911 1.9008 1.8406 3.2102 2.6416 2.4481 2.3559 1.9406 2.5265 1.5076 1.1938 1.3079 1.3619 1.1746 1.5333 1.5388 1.2925 1.3453 1.3442 1.6064 1.2943 1.8909 1.0910 1.0863 1.0456 1.0639 1.0954 8.1418 9.0510 1.0804 1.0343 1.0622 1.0845 1.0602 1.1006 1.1008 1.1043 1.1028 1.0445 1.0639 1.0640 1.0989
irintensity: 1.1190 0.5492 4.8908 0.5864 2.1702 1.7797 0.3720 3.4089 2.6448 0.2287 0.9183 25.2924 21.9110 8.0318 14.6664 2.3345 8.9507 14.8449 71.3141 13.4441 10.0111 47.5295 107.1073 301.5074 16.8369 33.9968 42.8090 15.4370 5.9670 2.6971 0.1414 15.2786 4.1977 27.9121 184.2673 384.5473 86.5761 15.5627 15.1174 2.8230 6.3879 8.4353 0.2691 3.0602 11.5692 11.9945 8.0278 5.8505 10.9700 13.6278 19.0146 11.3614 35.3212 7.7769 18.0373 15.5273 50.4639 191.8265 221.1586 49.0074 24.3269 16.7102 3.8162 18.9022 23.9532 23.7254 5.3632 1.7001 3.2320 21.4985 23.4204 4.6950
temp: 298.150 k
press: 1.00000 atm
elementType: 16 8 8 8 8 7 6 6 6 6 6 6 6 1 1 1 1 1 1 1 1 1 1 1 1 1
symmnumber: 1
zpe: 532815.8 jmol-1
zpe.correction: 0.202939 hartree
zpe.thermalcorrener: 0.218595 hartree
zpe.thermalcorrenthalpy: 0.219539 hartree
zpe.thermalcorrgfe: 0.158238 hartree
zpe.sumelectzpe: -1027.218110 hartree
zpe.sumelectthermal: -1027.202454 hartree
zpe.sumelectthermalent: -1027.201510 hartree
zpe.sumelectthermalfe: -1027.262811 hartree
dipole: -0.6395 0.0470 0.3308
dipole: 0.7216
quadrupole: -68.0985 -73.8902 -92.4484
quadrupole: -0.0041 -2.0756 -0.8808
quadrupole: 10.0472 4.2555 -14.3027 -0.0041 -2.0756 -0.8808
hfenergy: -1027.4210489 hartree
pointgroup: C01 [X(C7H13N1O4S1)]
dipole: -0.2514097 -0.1275107 0.0335006 debye
dipolederiv: -0.4538698 -0.0364368 -0.0327844 -0.0256225 -0.0404308 -0.0049661 -0.0699692 -0.0084755 -0.2072581 -1.1069246 0.1138905 0.3516458 0.1184191 -0.352631 -0.1508314 0.4949554 -0.1676729 -0.5135723 -0.8412219 0.1196767 0.0938683 0.296393 -0.5471303 0.1545412 -0.1195923 0.2259078 -0.547719 -1.3179369 0.0475779 0.2239773 0.081128 -0.3471861 0.0716984 0.3773546 0.068415 -0.401783 -0.9370267 -0.0289096 0.0329409 -0.217705 -0.4503458 -0.1991992 -0.2084092 -0.2280165 -0.5291326 -0.6261296 0.0465259 -0.155801 0.0436496 -0.6912469 0.1713443 -0.1225763 0.1458783 -0.4430451 0.0427619 0.029351 -0.0384867 -0.055011 0.0637424 0.0027566 -0.1006009 0.0292447 -0.2505878 0.2788341 0.1443349 0.0841833 0.1777189 0.0170962 0.0542329 0.1304932 0.0525117 0.1683412 0.2062538 -0.1053713 0.054333 -0.1908437 -0.0081647 -0.0200616 0.1754509 -0.0612721 0.174854 0.3803666 -0.1355732 0.1905156 0.049246 0.3293795 -0.143469 0.0757798 -0.2157629 0.1954296 -0.071016 -0.0953952 -0.0037165 -0.039673 0.0424161 0.0632557 0.0416799 0.0036761 0.0643279 1.4289556 -0.3503284 -0.4014553 -0.4780539 0.5247607 -0.2406381 -0.35339 -0.2582286 0.949851 1.7556633 0.0792755 -0.1742586 0.1669514 0.442812 0.3175158 -0.1742978 0.3809484 0.7269631 0.0395569 0.0362175 0.0172603 0.0605549 -0.0574864 -0.0137507 0.0253114 -0.0228978 0.0698803 0.1189196 -0.0290676 -0.0276056 -0.006776 -0.0168353 -0.0408813 -0.0535123 -0.0057088 0.0787461 0.0162415 -0.0258922 -0.0386719 -0.0568418 0.0585034 0.0350325 -0.0258508 0.0412709 -0.1209442 0.0105534 0.0273226 -0.0502287 0.0453641 0.0579905 -0.0511802 -0.0364415 -0.0491773 -0.1276475 0.0942537 0.0200471 -0.0276044 -0.0039395 -0.00037 0.0303396 -0.0415382 0.0062886 0.0807562 0.0089403 -0.0233235 -0.0063037 -0.0032214 -0.1601604 0.1195262 -0.007402 0.0747022 -0.042669 0.0600117 0.1115219 0.014663 0.0583364 -0.0836478 -0.0498738 -0.0252153 -0.0075965 0.0735588 0.1143478 -0.0159404 0.0142494 -0.009254 0.0338424 0.0882394 -0.0146279 0.0809947 -0.1259326 -0.1537632 -0.0540186 0.010584 -0.04354 0.0824019 -0.0157193 0.0505417 -0.0165937 0.0802145 0.0289025 0.0507131 0.0000743 -0.0683989 0.3499313 -0.0079926 0.0083261 0.0363749 0.1792584 0.243041 0.0661834 -0.021653 0.0795604 0.2167457 -0.1708597 0.0029582 -0.0933929 0.0895943 0.3421942 0.0565589 -0.0544162 0.0340088 0.2632072 0.1492847 -0.0117588 0.1250244 0.1855558 0.3380908 -0.0489402 -0.0553092 -0.01245 0.2728064 -0.1483442 -0.0176687 -0.136442 0.19296 unknown
polarizability: 139.4791696|-2.6395435|87.6491959|11.5506223|2.2263286|108.7545809 unknown
InChI: InChI=1S/C7H13NO4S/c1-4(6(9)10)2-13-3-5(8)7(11)12/h4-5,9,11H,2-3,8H2,1H3
charge 0 multiplicity 1
26 atoms
S  0.091489 -1.340666 -0.050964
O  3.883399 0.349366 -1.353397
O  1.865138 1.485049 -1.262458
O  -3.98494 0.694474 0.925265
O  -1.774536 1.319651 1.232632
N  -3.230337 0.500662 -1.767917
C  2.539226 0.003599 0.621239
C  1.065777 -0.13163 1.043134
C  -0.942422 -0.171726 -1.127737
C  -2.422272 -0.134058 -0.702211
C  3.344865 0.82488 1.673578
C  2.669294 0.684676 -0.734557
C  -2.626052 0.696869 0.567998
H  3.00069 -0.996505 0.530683
H  0.528313 0.8287 1.017984
H  1.00403 -0.539672 2.06595
H  -0.866493 -0.572778 -2.153475
H  -0.476771 0.824896 -1.108189
H  -2.745332 -1.173731 -0.451348
H  2.915257 1.835269 1.796286
H  3.309903 0.313173 2.651744
H  4.401074 0.923574 1.369817
H  -4.214153 0.637517 -1.517881
H  -3.101279 0.076203 -2.690597
H  3.955775 0.840232 -2.216923
H  -4.116044 1.261476 1.732945
