program: Gaussian 09
title: 000151430
version: EM64L-G09RevD.01
frameworkgroup: C1[X(C18H22O3)]
method: RPBEPBE
basis: SDD
operation: Freq
keyword: #pfreq=noraman
keyword: PBEPBE/SDD
title: #p freq=noraman PBEPBE/SDD
converged: YES YES NO NO
title: Mulliken charges:
elementType: O O O C C C C C C C C C C C C C C C C C C H H H H H H H H H H H H H H H H H H H H H H
charge: -0.437942 -0.175443 -0.435334 -0.170420 0.315424 -0.145558 -0.213449 -0.566942 -0.190224 -0.518813 -0.454869 0.044146 -0.507161 -0.793039 0.245236 -0.626245 0.416992 -0.398435 -0.645217 -0.418037 0.305852 0.224507 0.266517 0.229118 0.235510 0.244597 0.205974 0.226580 0.218143 0.214092 0.217957 0.248005 0.247787 0.227767 0.244021 0.229965 0.228583 0.220851 0.343089 0.259977 0.229819 0.252962 0.353658
chargesum: 0.00000
title: Mulliken charges with hydrogens summed into heavy atoms:
elementType: O O O C C C C C C C C C C C C C C C C C C
charge: -0.094853 -0.175443 -0.081676 0.054086 0.315424 0.120958 0.015669 -0.086835 0.015751 -0.074090 -0.022820 0.044146 -0.011369 -0.091286 0.245236 -0.176812 0.416992 -0.138458 -0.415398 -0.165075 0.305852
polarizability: 2.56868339e+02 1.69322527e+00 1.90144362e+02 1.14977018e+01 -9.54864312e+00 1.35306936e+02
1716.lowfreq: -14.0517 -6.8228 -0.0009 -0.0007 0.0003 3.1380 32.0769 59.0974 85.3628
frequency: 31.8659 59.0902 85.3381 94.9297 123.8320 138.7537 147.7048 187.4727 203.9371 210.3642 220.7321 249.2964 267.5927 273.5985 298.8887 328.3555 337.7626 353.4865 367.5156 386.4750 389.9858 404.5212 438.8260 445.0714 462.6843 481.7547 516.8772 541.7295 552.7001 559.5241 569.1309 605.8535 623.0903 646.6594 707.9977 722.8259 752.2379 791.9380 804.1972 823.4340 826.9410 838.4654 849.5930 890.4191 904.7648 926.7823 938.7034 945.4687 960.1832 973.7691 988.6844 994.8155 1007.1632 1020.8003 1036.7040 1048.6165 1066.6415 1071.7219 1097.9565 1110.9437 1123.1471 1134.3922 1141.7974 1162.6251 1168.3611 1184.9590 1192.9246 1198.6526 1203.3671 1220.5563 1232.9729 1242.5035 1248.9149 1257.2707 1271.6454 1278.4027 1288.0808 1291.5992 1301.0865 1303.0531 1309.8914 1311.9683 1320.5881 1346.9332 1356.8640 1366.4098 1380.8930 1389.6958 1395.7972 1427.9871 1436.7506 1463.0982 1464.6581 1471.5514 1476.4896 1484.0313 1487.7582 1496.6309 1602.4110 1623.3144 1656.1517 2908.9524 2929.1958 2950.1342 2961.0981 2981.0695 2984.6124 2989.5815 2998.8605 3001.5327 3004.7088 3034.6095 3052.4828 3057.3054 3069.2252 3072.2346 3080.7813 3090.8720 3099.9317 3122.9321 3170.0273 3540.4065 3582.5000
redmass: 5.1355 4.2017 3.2868 4.3658 3.3010 4.3661 2.5528 3.0979 2.8304 1.8174 2.4478 3.0849 2.5147 3.7076 2.2207 2.4999 1.7144 1.1149 3.7435 4.3895 3.9906 3.4115 2.5474 3.3889 3.9646 4.3754 4.9682 2.2967 2.9922 3.4157 3.3944 3.5582 4.3306 3.0908 4.1809 3.4962 3.2049 2.6251 2.0093 1.7313 1.6975 1.8988 1.6187 2.5682 3.1014 2.3204 2.5696 1.4183 2.2571 2.8137 2.2391 1.8795 2.3560 1.9226 2.4475 4.0517 2.1967 2.3301 2.2030 2.2115 2.1554 1.6574 1.5055 1.5905 1.3613 1.4157 1.5113 1.5132 1.7086 1.4987 1.7667 1.3704 1.8394 1.3764 2.4073 1.3431 1.5138 1.4091 1.2195 1.4722 1.4436 1.3797 1.4877 1.5213 1.3770 1.4643 1.2840 1.7820 2.7143 1.0805 3.5118 1.0892 1.0995 1.0835 1.1020 1.0526 1.0776 2.8150 6.5349 6.6909 12.0948 1.0811 1.0789 1.0841 1.0660 1.0765 1.0672 1.0386 1.0596 1.0614 1.0657 1.0958 1.1005 1.0987 1.1014 1.1018 1.0990 1.0987 1.0911 1.0891 1.0948 1.0658 1.0660
irintensity: 0.5421 2.0778 1.3294 0.1023 2.4574 4.4404 0.3701 0.4008 0.7877 1.1990 0.5836 0.3241 0.7945 5.9120 39.0430 18.2138 41.1758 142.3668 0.7787 1.4832 9.1583 11.7402 4.9198 1.9730 22.7150 3.9199 2.3644 3.4792 5.1463 2.2743 7.7271 3.4418 2.7140 4.8690 8.0186 5.0574 0.6650 4.4457 4.0703 7.8648 12.4282 11.3486 35.6526 10.9735 12.3924 5.7476 5.1334 6.2127 40.8451 2.5203 32.0744 8.9840 10.8172 10.9601 26.8340 13.6748 23.3570 21.8626 0.7935 1.3968 29.3478 156.4337 98.4200 20.1523 5.7123 6.9111 0.5118 20.7649 4.6695 10.1228 16.5697 58.5949 11.1479 0.6253 11.4159 2.2625 1.0464 2.2082 1.4602 1.6774 12.7230 1.9202 0.3413 4.7161 9.2745 1.0513 21.4991 5.8030 22.3325 17.5546 46.7907 8.1678 3.2808 7.6177 8.8062 12.2750 9.7073 70.9294 6.8702 66.5885 189.3865 16.0594 1.9260 42.5183 22.0921 28.4587 34.8775 26.4629 22.2517 24.1495 21.5401 23.9164 46.3853 11.9586 2.6224 53.0711 22.7524 28.8306 22.8205 11.5516 6.1906 2.0750 40.7899
temp: 298.150 k
press: 1.00000 atm
elementType: 8 8 8 6 6 6 6 6 6 6 6 6 6 6 6 6 6 6 6 6 6 1 1 1 1 1 1 1 1 1 1 1 1 1 1 1 1 1 1 1 1 1 1
symmnumber: 1
zpe: 945686.3 jmol-1
zpe.correction: 0.360193 hartree
zpe.thermalcorrener: 0.378938 hartree
zpe.thermalcorrenthalpy: 0.379882 hartree
zpe.thermalcorrgfe: 0.314692 hartree
zpe.sumelectzpe: -923.219509 hartree
zpe.sumelectthermal: -923.200764 hartree
zpe.sumelectthermalent: -923.199820 hartree
zpe.sumelectthermalfe: -923.265010 hartree
dipole: 2.9225 5.3812 0.9244
dipole: 6.1930
quadrupole: -140.0451 -123.5274 -126.0417
quadrupole: -2.8339 -6.8013 -6.1400
quadrupole: -10.1737 6.3440 3.8297 -2.8339 -6.8013 -6.1400
hfenergy: -923.5797019 hartree
pointgroup: C01 [X(C18H22O3)]
dipole: -1.1377631 2.123028 -0.3673027 debye
polarizability: 256.7617588|-2.0686619|190.1573434|11.9980303|9.4996165|135.4005355 unknown
InChI: InChI=1S/C18H22O3/c1-18-9-15(20)17-12-5-3-11(19)8-10(12)2-4-13(17)14(18)6-7-16(18)21/h3,5,8,13-15,17,19-20H,2,4,6-7,9H2,1H3
charge 0 multiplicity 1
43 atoms
O  0.009723 -2.653243 1.361046
O  5.005914 -0.99948 0.156867
O  -5.811635 0.042918 -0.809852
C  1.962545 0.893153 0.163414
C  2.606146 -0.455707 -0.28156
C  0.449044 0.936695 -0.105878
C  -0.227627 -0.290786 0.612799
C  2.007365 -1.606175 0.549247
C  0.474584 -1.654759 0.374553
C  2.903296 1.975874 -0.42937
C  -0.211444 2.274513 0.363539
C  4.103839 -0.157876 -0.064134
C  4.315274 1.371119 -0.178794
C  2.475806 -0.737711 -1.814847
C  -1.711093 -0.278836 0.243572
C  -1.593476 2.085279 1.067638
C  -2.396538 0.95117 0.460315
C  -2.41981 -1.35736 -0.34194
C  -3.758624 1.079692 0.114696
C  -3.783373 -1.238562 -0.685201
C  -4.45198 -0.018109 -0.450125
H  2.086361 0.939823 1.271431
H  0.268535 0.824175 -1.193609
H  -0.135512 -0.103098 1.707405
H  2.22618 -1.454036 1.623698
H  2.439084 -2.582222 0.265652
H  0.230062 -2.011382 -0.649703
H  2.777941 2.960292 0.053786
H  2.716681 2.11442 -1.510714
H  -0.334723 2.94136 -0.509449
H  0.46693 2.795348 1.067604
H  4.744868 1.723978 0.779118
H  5.061969 1.601088 -0.959895
H  2.945837 0.05186 -2.428283
H  2.978803 -1.692252 -2.051091
H  1.421205 -0.818542 -2.128692
H  -2.162445 3.032633 1.046725
H  -1.408375 1.855013 2.137488
H  -0.981676 -2.639637 1.389955
H  -1.91482 -2.304006 -0.56778
H  -4.275641 2.03477 0.283342
H  -4.335414 -2.068879 -1.134819
H  -6.188986 0.934886 -0.608457
