program: Gaussian 09
title: 000151428
version: EM64L-G09RevD.01
frameworkgroup: C1[X(C9H19N3O4)]
method: RPBEPBE
basis: SDD
operation: Freq
keyword: #p
keyword: freq=noraman
keyword: PBEPBE/SDD
title: #p freq=noraman PBEPBE/SDD
converged: YES YES NO NO
title: Mulliken charges:
elementType: O O O O N N N C C C C C C C C C H H H H H H H H H H H H H H H H H H H
charge: -0.284672 -0.473582 -0.424292 -0.217360 -0.374885 -0.590880 -0.545149 -0.415195 -0.211406 -0.376827 -0.360662 0.228967 -0.131657 -0.420354 -0.354442 0.194597 0.189686 0.222393 0.209433 0.257957 0.171184 0.190417 0.177445 0.295840 0.202144 0.222096 0.336376 0.303533 0.256725 0.234756 0.222572 0.256905 0.259921 0.362782 0.385635
chargesum: 0.00000
title: Mulliken charges with hydrogens summed into heavy atoms:
elementType: O O O O N N N C C C C C C C C C
charge: -0.284672 -0.110800 -0.038657 -0.217360 -0.038509 -0.030623 -0.028323 -0.003116 -0.001974 0.052313 0.007200 0.228967 0.164183 0.003886 0.102887 0.194597
polarizability: 1.49300174e+02 -3.99666987e+00 1.38144747e+02 -5.65182175e-01 -1.62801882e+00 1.10491914e+02
1716.lowfreq: -14.7235 -4.9096 0.0004 0.0005 0.0010 4.1097 13.9873 28.7978 52.5697
frequency: 12.9343 28.3055 52.5578 54.0914 62.7974 72.4672 83.5878 90.5764 113.4941 126.8065 146.1190 188.7234 220.3368 229.2257 247.8773 263.6234 264.9996 286.2819 295.1372 306.8730 338.5102 374.4203 438.6282 475.3983 490.1716 538.8786 565.9610 619.0899 622.4395 639.9923 649.6587 662.0583 712.1763 721.0588 733.5183 772.8562 803.9377 877.4894 903.9200 920.3501 975.1692 999.4066 1001.6742 1012.5664 1033.6973 1048.4627 1061.1699 1062.5841 1089.8913 1095.0517 1115.8617 1136.6752 1156.2686 1179.7679 1212.3790 1226.1056 1236.0300 1243.3640 1265.4953 1278.0859 1285.6114 1291.2816 1296.1990 1313.2728 1332.0311 1334.0535 1353.1172 1357.2165 1386.1739 1398.9004 1452.4198 1458.2090 1469.7996 1471.6618 1484.8239 1489.1871 1587.3026 1642.9790 1643.0315 1674.0370 2945.3097 2950.3334 2954.6046 2961.4395 2981.4630 2985.7674 2997.5000 3012.8596 3017.9299 3038.4090 3050.3909 3058.2271 3438.3529 3443.6354 3522.7484 3554.0840 3569.0510 3573.4474 3598.5674
redmass: 5.6064 5.2434 3.5461 3.0743 3.9464 5.1173 3.7857 4.8447 4.3988 3.6850 1.9389 2.8186 2.7786 4.9221 1.3753 1.9134 1.1678 3.2379 1.5191 3.0613 4.9165 3.8470 2.8167 3.0000 2.8022 3.3613 3.4893 1.5352 1.5745 1.3326 1.6946 1.9700 3.6786 4.3384 1.1131 1.4937 2.5747 1.8082 2.5930 2.4514 3.8689 1.6561 3.0931 2.2730 3.2725 3.5428 2.4511 2.2769 3.7436 1.4336 2.5988 1.5745 1.2125 1.5643 1.2765 1.4578 1.2815 1.6467 1.5786 1.2780 1.5718 1.1642 1.1670 1.2538 1.7572 1.1871 1.3106 1.4439 1.5490 1.3940 1.0878 1.0735 1.0881 1.0781 1.8113 1.2459 2.3601 1.2850 1.2838 9.4243 1.0640 1.0615 1.0812 1.0636 1.0626 1.0580 1.0948 1.0816 1.0968 1.1034 1.1043 1.1070 1.0451 1.0445 1.0643 1.0779 1.0970 1.0969 1.0669
irintensity: 1.6140 0.1360 7.7678 1.8381 2.4277 0.8316 0.5993 2.6717 4.7129 2.5020 1.4169 8.5505 43.7668 2.5316 58.0230 32.1468 99.5872 6.5099 30.2523 27.7295 9.1273 4.6488 19.9895 33.2594 13.3672 31.1827 16.5435 337.6469 217.8554 29.4909 262.2677 69.7685 1.4008 0.4114 8.7450 2.1789 2.7781 15.0043 16.5336 11.5768 26.0075 9.3184 17.4314 24.1153 239.3769 5.8800 2.6621 78.4337 17.4782 1.2960 19.4754 10.7487 6.8585 21.9999 4.4269 3.7267 7.9240 62.5233 1.6348 1.4680 40.2112 0.1949 4.2125 1.9119 44.5872 0.5877 6.3417 3.5364 12.7005 2.1115 0.9600 0.8825 4.9061 16.2888 157.5309 108.7644 211.2589 18.1150 41.1708 238.9113 5.9194 21.9854 42.0016 75.1026 56.7395 50.9092 21.6224 20.8557 7.1538 2.4976 105.3363 30.0950 11.6119 1.5764 28.7178 39.1568 0.0193 6.9203 8.8507
temp: 298.150 k
press: 1.00000 atm
elementType: 8 8 8 8 7 7 7 6 6 6 6 6 6 6 6 6 1 1 1 1 1 1 1 1 1 1 1 1 1 1 1 1 1 1 1
symmnumber: 1
zpe: 764488.3 jmol-1
zpe.correction: 0.291178 hartree
zpe.thermalcorrener: 0.310750 hartree
zpe.thermalcorrenthalpy: 0.311694 hartree
zpe.thermalcorrgfe: 0.240602 hartree
zpe.sumelectzpe: -818.205333 hartree
zpe.sumelectthermal: -818.185761 hartree
zpe.sumelectthermalent: -818.184817 hartree
zpe.sumelectthermalfe: -818.255909 hartree
dipole: 2.1776 -0.8140 1.6725
dipole: 2.8638
quadrupole: -78.4763 -103.9563 -93.9457
quadrupole: -20.4344 9.6607 6.3058
quadrupole: 13.6498 -11.8302 -1.8196 -20.4344 9.6607 6.3058
hfenergy: -818.4965113 hartree
pointgroup: C01 [X(C9H19N3O4)]
dipole: 0.8825812 0.3269156 -0.6194099 debye
polarizability: 149.3044935|3.8728204|138.1155999|1.995116|-0.7756594|110.5167418 unknown
InChI: InChI=1S/C9H19N3O4/c10-4-2-1-3-6(11)8(14)12-7(5-13)9(15)16/h6-7,12-13,15H,1-5,10-11H2
charge 0 multiplicity 1
35 atoms
O  0.993471 -1.983169 1.508995
O  2.979607 1.036303 -1.821866
O  2.725154 2.358043 1.353874
O  0.53697 1.917269 0.712875
N  1.311819 -0.606527 -0.333475
N  -0.297232 -3.797628 -0.170532
N  -5.045751 2.246923 -0.156107
C  -1.829218 -1.762954 -0.030613
C  -0.441699 -2.357283 -0.44962
C  -2.077268 -0.303573 -0.474209
C  -3.481873 0.209869 -0.081766
C  0.679753 -1.643238 0.3242
C  2.32111 0.214211 0.321819
C  -3.732635 1.676948 -0.526513
C  3.533034 0.424901 -0.599251
C  1.727443 1.558449 0.781926
H  -2.609841 -2.417112 -0.473281
H  -1.922926 -1.850509 1.070426
H  -0.306951 -2.176052 -1.536993
H  -1.314329 0.365363 -0.03127
H  -1.961097 -0.228575 -1.577891
H  -3.603773 0.142865 1.019828
H  -4.263456 -0.442961 -0.526297
H  2.639378 -0.327807 1.234391
H  -3.627532 1.747999 -1.627211
H  -2.943598 2.32459 -0.098138
H  1.047145 -0.345187 -1.285576
H  0.015335 -3.96528 0.79393
H  -1.120208 -4.351685 -0.426046
H  4.265775 1.091839 -0.108754
H  3.993244 -0.558661 -0.819593
H  -5.841821 1.766579 -0.589422
H  -5.179087 2.347828 0.85581
H  3.703304 1.234788 -2.464723
H  2.32425 3.212934 1.667774
