program: Gaussian 09
title: 000151427
version: EM64L-G09RevD.01
frameworkgroup: C1[X(C8H15NO2)]
method: RPBEPBE
basis: SDD
operation: Freq
keyword: #p
keyword: freq=noraman
keyword: PBEPBE/SDD
title: #p freq=noraman PBEPBE/SDD
converged: YES YES NO NO
title: Mulliken charges:
elementType: O O N C C C C C C C C H H H H H H H H H H H H H H H
charge: -0.270181 -0.254387 -0.054755 0.031819 -0.432517 -0.415169 -0.391600 -0.395016 -0.616522 0.282098 -0.759591 0.231948 0.206341 0.222525 0.216063 0.227302 0.219869 0.176884 0.181331 0.219278 0.223951 0.224982 0.187870 0.246936 0.246718 0.243823
chargesum: 0.00000
title: Mulliken charges with hydrogens summed into heavy atoms:
elementType: O O N C C C C C C C C
charge: -0.270181 -0.254387 -0.054755 0.263767 -0.003650 0.028196 0.005153 0.005594 0.020280 0.282098 -0.022114
polarizability: 1.24678654e+02 6.38839672e-01 9.05896600e+01 1.31756018e+00 -2.64953861e+00 7.99266962e+01
1716.lowfreq: -22.2804 -0.0006 -0.0006 0.0005 5.8980 9.2114 22.3687 46.5457 67.6503
frequency: -21.5821 46.3612 67.6172 91.9571 159.0610 214.0230 239.9693 246.1675 266.4442 307.9569 344.7699 367.2947 436.5443 461.4209 479.6606 565.6786 573.9331 632.3637 743.9185 817.5895 835.3142 854.0386 922.2377 945.8924 980.6690 995.2641 1008.5174 1033.7343 1040.7943 1069.5183 1090.8886 1127.2073 1132.9186 1144.2705 1148.9017 1206.0464 1207.4130 1260.9206 1272.1472 1275.8398 1306.8463 1309.4710 1338.9099 1354.0369 1359.5043 1375.9067 1382.1449 1432.8263 1451.9804 1453.1391 1454.6748 1463.5357 1463.9662 1466.1204 1480.1614 1483.0806 1644.6374 2815.7315 2826.1603 2859.2365 3004.8087 3006.5282 3007.1297 3010.8778 3018.5995 3029.6263 3035.0750 3073.6943 3076.8086 3080.1951 3095.4881 3141.4213
redmass: 1.0888 5.5746 3.2826 3.0396 3.5834 1.4258 1.8290 2.0587 3.7180 3.1415 1.9400 2.6558 3.1948 2.4249 2.9863 2.8430 3.2662 3.8795 3.3573 1.4619 2.8488 3.6548 1.8205 3.4300 1.4312 1.8643 2.8575 2.3034 1.6696 1.6594 1.5276 1.9607 1.9860 1.3945 2.1119 2.0148 2.4648 1.3678 1.8640 1.4498 1.2892 1.3085 1.3643 1.5249 1.5143 1.3851 1.2698 1.1728 1.0880 1.0667 1.0475 1.0585 1.0733 1.0922 1.1046 1.0548 9.1777 1.0718 1.0695 1.0575 1.0773 1.0606 1.0373 1.0687 1.0725 1.0852 1.0866 1.1037 1.1010 1.1038 1.0974 1.1010
irintensity: 1.2958 1.5582 1.9768 2.7088 0.3724 0.2149 6.8180 7.4012 1.5874 2.5215 5.0184 4.3642 6.7359 0.6108 0.0945 1.7107 1.9524 5.3729 10.2314 0.7945 4.8027 11.3096 1.5315 40.6997 4.9867 25.0279 162.0653 13.4893 10.5352 23.1930 11.2085 1.7872 9.7986 1.5412 9.3541 129.1518 254.7096 3.7573 24.9217 12.8162 2.3464 1.8541 0.8757 16.8411 2.5788 1.0656 50.4356 2.2323 8.0219 30.7376 16.3171 19.1641 2.4571 16.2516 11.7420 8.3666 178.1869 56.6654 96.9687 195.9175 0.8944 13.0272 4.0931 29.2658 45.4398 70.1326 26.9374 14.7198 37.0791 40.2606 8.8284 11.7663
temp: 298.150 k
press: 1.00000 atm
elementType: 8 8 7 6 6 6 6 6 6 6 6 1 1 1 1 1 1 1 1 1 1 1 1 1 1 1
symmnumber: 1
zpe: 585677.2 jmol-1
zpe.correction: 0.223073 hartree
zpe.thermalcorrener: 0.234211 hartree
zpe.thermalcorrenthalpy: 0.235156 hartree
zpe.thermalcorrgfe: 0.185844 hartree
zpe.sumelectzpe: -518.155498 hartree
zpe.sumelectthermal: -518.144359 hartree
zpe.sumelectthermalent: -518.143415 hartree
zpe.sumelectthermalfe: -518.192726 hartree
dipole: 1.1302 1.0765 -0.4860
dipole: 1.6347
quadrupole: -60.8222 -67.5188 -70.2098
quadrupole: -4.8729 6.7294 4.1836
quadrupole: 5.3614 -1.3352 -4.0262 -4.8729 6.7294 4.1836
hfenergy: -518.3785702 hartree
pointgroup: C01 [X(C8H15N1O2)]
dipole: -0.4568685 0.4026966 0.2067805 debye
dipolederiv: -1.7589849 0.1934215 0.1582581 0.3168135 -0.4912355 -0.1432482 0.1734958 -0.1245335 -0.3970246 -0.700473 -0.0410659 -0.0608717 0.2559961 -0.6180841 -0.3128233 0.2428506 -0.3263438 -0.6274485 -0.6970436 -0.0343458 -0.0403765 -0.0252312 -0.5211769 -0.0123779 0.0139092 -0.0062987 -0.5596606 0.9633963 -0.0134601 -0.0479688 0.0981563 0.2714598 -0.0457886 0.1051646 -0.0963479 0.2495953 -0.1312995 -0.0143677 -0.0070036 -0.0205419 0.0389039 -0.0090396 -0.0473513 0.0144487 0.126119 -0.17632 -0.0012104 -0.0141834 -0.0395563 -0.0097975 0.0410106 -0.0669371 0.0533152 0.0895346 0.1731815 0.1004571 -0.0628639 0.1826791 0.3756075 -0.0850166 -0.0126814 -0.0974211 0.4818403 0.2816206 -0.1710788 -0.0220377 -0.2426764 0.3805419 0.0917595 0.0586303 0.1094289 0.3882837 0.4976457 0.0762332 0.0721361 0.0841216 0.112437 0.0733322 0.0835276 0.0722705 0.3503808 1.7827188 -0.1081474 -0.0144493 -0.5486996 0.7236575 0.5471858 -0.395523 0.5436836 0.7192255 -0.3300853 -0.0959562 -0.1279834 -0.1385699 -0.041529 -0.08897 -0.1880863 -0.091674 -0.0803059 -0.0045261 0.0035078 0.0184391 -0.0408459 0.0261653 -0.031634 -0.0415554 -0.0010226 -0.1013659 0.0308185 -0.0749647 0.0351199 -0.0545004 -0.0986826 0.0902529 0.0532756 0.1170853 0.0180608 0.0612984 0.0103074 -0.0144702 0.0254719 0.0697328 -0.0151591 -0.0184866 -0.0845735 -0.1168162 0.0734551 -0.0273576 -0.002905 -0.0352132 0.0544288 -0.0703485 -0.0180605 -0.0077477 -0.121711 -0.0071536 0.1063367 -0.0007631 0.0999102 -0.0675589 -0.0006827 0.0207005 -0.0322241 0.075508 -0.0767738 0.143702 0.0141969 0.1027113 -0.0873001 0.0021955 0.0401859 -0.021988 0.0571057 0.0090467 -0.0477896 0.0048402 -0.0598404 -0.0127733 -0.0917166 0.0100449 0.0840848 -0.2979649 -0.0227954 0.0451067 -0.0270555 0.0678091 -0.0286211 -0.025288 0.0219551 -0.1868052 -0.2395127 -0.0211805 -0.09633 0.0587207 -0.0591894 -0.1023166 0.0744962 0.0563418 0.1015168 0.0147597 -0.0329762 0.0818894 0.0146924 0.1811466 -0.0718535 -0.0571795 0.0010849 -0.0532417 0.0785795 0.0394224 -0.0486636 0.0180868 -0.1440443 -0.0624056 0.1148148 0.0476971 0.1134237 0.001829 -0.0753955 -0.0205152 0.0046377 -0.0707025 0.0429274 -0.0698399 -0.2138392 -0.1015799 -0.2436177 0.0895844 -0.0237311 0.0328373 0.0077515 0.1232993 0.045744 -0.0029748 0.0329044 -0.0704419 0.090234 0.0118683 -0.0218438 -0.0271115 -0.0748768 0.0281001 0.0083268 0.041619 0.125735 -0.0574151 0.0461541 0.0328106 0.0841557 0.0690504 -0.0497792 0.0683051 -0.0519791 0.079313 unknown
polarizability: 124.7008925|0.4943044|90.4207211|0.8667287|2.991565|80.0733963 unknown
InChI: InChI=1S/C8H15NO2/c1-7(10)11-8-3-5-9(2)6-4-8/h8H,3-6H2,1-2H3
charge 0 multiplicity 1
26 atoms
O  1.638539 0.620154 0.316193
O  2.663433 -0.933221 -1.096648
N  -2.559467 -0.095304 0.298479
C  0.290138 0.233949 -0.218779
C  -0.625835 1.445939 -0.019913
C  -0.246243 -0.996708 0.530632
C  -2.063901 1.083391 -0.450861
C  -1.696612 -1.281442 0.083349
C  -3.980448 -0.378534 0.019993
C  2.746553 -0.050912 -0.210906
C  4.020431 0.450071 0.43684
H  0.411885 -0.006575 -1.293377
H  -0.258122 2.306051 -0.609004
H  -0.625497 1.731335 1.047554
H  -0.23407 -0.791925 1.616856
H  0.390253 -1.876046 0.32585
H  -2.737531 1.936393 -0.248565
H  -2.084907 0.901062 -1.55957
H  -1.696478 -1.596984 -0.994738
H  -2.106006 -2.124717 0.669458
H  -4.592321 0.508175 0.265183
H  -4.324351 -1.215588 0.65376
H  -4.179123 -0.650488 -1.048326
H  3.98927 0.267068 1.525008
H  4.11879 1.539632 0.291016
H  4.887221 -0.064875 -0.001683
