program: Gaussian 09
title: 000151264
version: EM64L-G09RevD.01
frameworkgroup: C1[X(C15H22N2O4)]
method: RPBEPBE
basis: SDD
operation: Freq
keyword: #p
keyword: freq=noraman
keyword: PBEPBE/SDD
title: #p freq=noraman PBEPBE/SDD
converged: YES YES NO NO
title: Mulliken charges:
elementType: O O O O N N C C C C C C C C C C C C C C C H H H H H H H H H H H H H H H H H H H H H H
charge: -0.434799 -0.288682 -0.214529 -0.309466 -0.388193 -0.567625 0.035896 -0.439808 -0.401778 -0.165916 -0.756552 -0.402192 0.148538 0.307793 -0.476689 0.468289 -0.390591 -0.366987 -0.226167 -0.230110 -0.233676 0.207409 0.214167 0.223497 0.178441 0.223756 0.295390 0.215260 0.250653 0.203167 0.181890 0.213535 0.346912 0.272506 0.259039 0.389678 0.221139 0.245117 0.232545 0.273177 0.226954 0.229138 0.229874
chargesum: 0.00000
title: Mulliken charges with hydrogens summed into heavy atoms:
elementType: O O O O N N C C C C C C C C C C C C C C C
charge: -0.045121 -0.288682 -0.214529 -0.309466 -0.041281 -0.036081 0.243305 -0.002145 0.000420 0.129474 -0.087471 -0.006767 0.148538 0.307793 -0.010433 0.468289 -0.158045 -0.093810 0.000787 -0.000972 -0.003802
polarizability: 2.02727146e+02 2.30092345e+01 1.84413490e+02 -1.61321455e+01 1.14613601e+01 1.66377653e+02
1716.lowfreq: -9.1927 -4.7010 -0.0007 -0.0003 0.0003 4.5744 12.1699 15.9695 29.4668
frequency: 5.7953 15.7416 29.0433 32.7890 37.9973 49.2198 53.9736 73.3074 83.1195 93.6250 116.7735 137.4889 155.1444 176.1550 216.5033 226.4258 236.6589 253.9023 262.1605 284.4575 312.3227 345.2089 367.3449 392.6648 402.8041 410.9423 438.3517 480.8370 503.6022 550.5764 572.7785 593.1065 596.6193 600.3476 607.6493 617.8423 656.6399 694.4943 696.2411 704.9991 757.3721 778.8843 815.1932 824.6341 840.0634 858.8958 861.5107 890.6377 915.4602 934.8278 957.1855 972.0540 981.2536 984.7837 987.1348 990.4849 1001.3227 1003.2150 1026.8055 1064.7510 1073.5675 1090.2095 1097.1357 1118.3936 1126.3799 1149.0515 1168.0855 1173.1985 1187.5522 1201.6819 1220.2314 1230.3819 1236.6346 1238.7694 1257.5653 1281.2785 1291.4474 1294.5135 1311.2374 1325.1466 1328.3340 1338.6670 1343.3687 1349.5948 1385.3902 1387.7090 1395.0400 1442.2799 1452.3168 1461.0531 1462.1014 1473.7093 1483.8494 1489.6905 1491.3010 1494.6931 1594.1037 1614.7386 1637.4543 1648.3573 1671.0286 2866.9710 2950.2447 2971.0059 2974.4541 2980.6262 3010.7154 3036.4242 3038.9756 3041.7506 3062.6345 3066.2412 3080.1025 3110.0653 3118.8638 3127.3795 3139.2337 3149.9635 3164.3435 3450.9319 3525.3575 3566.6548 3578.7515
redmass: 4.5747 4.4499 3.7965 4.2711 9.2016 2.3231 4.8912 4.3991 6.1238 4.0865 4.0975 3.4463 5.4491 1.8974 2.8531 1.7129 2.0714 1.8093 3.2789 5.7380 3.4072 2.8073 2.8439 3.4691 2.8199 3.0041 2.1639 3.7650 3.1331 4.6407 2.0436 1.8301 1.7073 1.5450 1.6897 6.1742 4.5013 3.5586 9.1849 1.8972 2.1046 1.2425 3.5860 4.2627 2.1425 1.3169 2.4457 2.8200 1.9388 1.4942 2.3607 1.6540 1.8071 1.8937 1.8798 4.9995 1.3409 2.5269 2.2047 1.9928 2.2377 1.5164 2.7501 2.1582 2.6698 2.1567 1.9734 1.0543 1.1210 2.0262 2.8927 1.4379 1.1571 1.2951 1.2826 1.3422 1.1905 1.7327 1.3128 1.3521 1.2601 1.4100 1.4323 1.2963 8.0369 1.3567 1.2547 2.1798 1.1066 1.1240 1.0871 1.0614 2.2688 1.8163 1.0870 1.0532 6.0976 6.1001 1.0938 9.4190 9.1639 1.0710 1.0669 1.0476 1.0636 1.0652 1.0855 1.0587 1.0995 1.0978 1.0871 1.0981 1.0990 1.1071 1.0868 1.0872 1.0921 1.0964 1.1016 1.0447 1.0643 1.0772 1.0975
irintensity: 0.2355 0.2853 0.4747 0.5538 2.4290 3.0672 0.7331 1.7918 8.4227 1.4303 0.6440 0.3237 1.5369 1.5391 1.5034 23.0047 4.9069 11.6518 20.2349 2.0106 10.2275 5.4668 1.2096 11.4560 0.0559 2.5930 1.2707 28.9373 25.2823 2.3954 12.4583 218.3084 7.3173 231.0390 54.6713 0.6621 11.9808 33.2097 26.2745 73.2354 66.6328 3.9672 7.9546 5.7121 5.1149 0.8505 15.4201 67.1263 14.9420 10.4893 70.2355 10.9282 46.5691 67.5196 11.3052 5.8913 0.3559 63.5732 3.4125 22.3543 185.9852 4.9309 48.0039 8.7463 30.2203 21.7852 2.0155 0.0750 8.1250 186.9810 23.5852 25.0488 7.3564 13.4512 16.2134 10.5110 6.7966 48.4746 14.4143 11.2255 1.7174 1.9022 1.5625 11.8264 0.6490 18.5162 17.7412 9.3846 52.1022 12.7697 10.6748 6.6487 10.3836 396.1700 2.4414 2.7630 1.9196 0.4597 40.6016 225.8926 239.6476 120.4795 17.9718 11.7124 29.2216 42.1048 29.5340 37.3705 19.8104 39.2686 4.3040 61.3585 26.7617 5.4886 6.2450 1.6601 17.1648 25.6611 21.9276 1.4103 32.2115 60.2584 0.1912
temp: 298.150 k
press: 1.00000 atm
elementType: 8 8 8 8 7 7 6 6 6 6 6 6 6 6 6 6 6 6 6 6 6 1 1 1 1 1 1 1 1 1 1 1 1 1 1 1 1 1 1 1 1 1 1
symmnumber: 1
zpe: 930461.7 jmol-1
zpe.correction: 0.354394 hartree
zpe.thermalcorrener: 0.377109 hartree
zpe.thermalcorrenthalpy: 0.378053 hartree
zpe.thermalcorrgfe: 0.296999 hartree
zpe.sumelectzpe: -993.599206 hartree
zpe.sumelectthermal: -993.576491 hartree
zpe.sumelectthermalent: -993.575547 hartree
zpe.sumelectthermalfe: -993.656601 hartree
dipole: 0.2764 0.6231 -3.8875
dipole: 3.9468
quadrupole: -120.2649 -123.9032 -120.8908
quadrupole: -2.4337 7.4906 3.8541
quadrupole: 1.4214 -2.2169 0.7955 -2.4337 7.4906 3.8541
hfenergy: -993.9535998 hartree
pointgroup: C01 [X(C15H22N2O4)]
dipole: -0.19475 0.1735764 1.530721 debye
polarizability: 193.7237109|-22.747181|197.8353033|-17.1683337|-7.3266658|161.9592758 unknown
InChI: InChI=1S/C15H22N2O4/c1-11(7-8-16)9-13(14(18)19)17-15(20)21-10-12-5-3-2-4-6-12/h2-6,11,13,17-18H,7-10,16H2,1H3
charge 0 multiplicity 1
43 atoms
O  2.770907 -3.140182 1.669852
O  -1.309456 -1.759754 0.392875
O  4.248583 -3.137523 -0.125059
O  -0.162793 -1.442497 -1.651819
N  0.957964 -1.669516 0.400712
N  3.044944 3.992241 1.776012
C  2.315192 0.979976 -0.576997
C  3.01373 -0.226716 0.106833
C  2.901672 2.319661 -0.04966
C  2.312009 -1.601371 -0.153937
C  2.432396 0.901322 -2.118121
C  2.460314 2.693046 1.381938
C  3.207907 -2.702616 0.40726
C  -0.157801 -1.606293 -0.400627
C  -2.615003 -1.584303 -0.33148
C  -3.063345 -0.138455 -0.32388
C  -3.940879 0.337851 0.682852
C  -2.607053 0.759163 -1.324854
C  -4.354776 1.688784 0.695205
C  -3.018795 2.11004 -1.312327
C  -3.893569 2.578138 -0.303348
H  1.237374 0.955409 -0.311954
H  3.062044 -0.069948 1.202225
H  4.055627 -0.300511 -0.263875
H  4.012066 2.279325 -0.098297
H  2.590054 3.146166 -0.715971
H  2.234639 -1.761993 -1.243117
H  1.955225 1.781939 -2.585927
H  1.928901 0.005751 -2.522357
H  3.493841 0.885347 -2.433645
H  2.711701 1.859813 2.083975
H  1.357978 2.796054 1.395435
H  0.838191 -1.862248 1.396483
H  2.667795 4.382487 2.64511
H  4.070328 4.002536 1.766803
H  3.399756 -3.826563 2.020708
H  -3.301004 -2.231026 0.237673
H  -2.48385 -1.966758 -1.3583
H  -4.298333 -0.350986 1.458416
H  -1.923077 0.390892 -2.097921
H  -5.03532 2.046102 1.476207
H  -2.662237 2.795828 -2.089006
H  -4.21525 3.625785 -0.296695
