program: Gaussian 09
title: 000151197
version: EM64L-G09RevD.01
frameworkgroup: C1[X(C6H13O9P)]
method: RPBEPBE
basis: SDD
operation: Freq
keyword: #p
keyword: freq=noraman
keyword: PBEPBE/SDD
title: #p freq=noraman PBEPBE/SDD
converged: YES YES NO NO
title: Mulliken charges:
elementType: P O O O O O O O O O C C C C C C H H H H H H H H H H H H H
charge: 1.397784 -0.447289 -0.483450 -0.561353 -0.472491 -0.259803 -0.444169 -0.682656 -0.667603 -0.574088 -0.095768 -0.055292 -0.190874 -0.303963 0.146598 -0.343558 0.231859 0.219944 0.271015 0.268130 0.252227 0.368371 0.383688 0.224194 0.270901 0.374071 0.363215 0.409705 0.400655
chargesum: 0.00000
title: Mulliken charges with hydrogens summed into heavy atoms:
elementType: P O O O O O O O O O C C C C C C
charge: 1.397784 -0.078917 -0.099762 -0.561353 -0.098420 -0.259803 -0.080955 -0.272951 -0.266948 -0.574088 0.136091 0.164652 0.080141 0.216394 0.146598 0.151537
polarizability: 1.52905061e+02 6.65461328e+00 1.16196850e+02 -3.70829261e+00 -4.78227589e-01 9.31183959e+01
1716.lowfreq: -8.2195 -0.0022 -0.0019 -0.0016 3.3193 5.2748 13.1993 27.3550 39.8650
frequency: 13.0423 27.1883 39.7458 48.9892 69.9634 84.2181 103.3276 110.5414 116.1150 162.1510 171.1326 186.8460 219.2341 233.1060 249.7077 266.4645 294.2226 324.6711 343.6412 351.8522 375.1209 378.0570 383.5913 402.0847 424.3934 429.9103 476.0999 495.1459 509.1372 537.8886 573.7514 623.0558 653.3420 730.0839 742.5643 747.7217 803.1384 873.0944 922.5572 944.3291 953.9785 995.5732 1004.5432 1014.4827 1018.2518 1026.7156 1055.0211 1073.2834 1092.3893 1106.2801 1127.8909 1166.0520 1190.5813 1218.0173 1235.0740 1257.7380 1266.7922 1272.6641 1300.6686 1321.3438 1347.1543 1363.9692 1379.9821 1390.7057 1429.7476 1442.5033 1463.3389 1580.1600 2922.0674 2965.2827 2981.2869 3000.2269 3023.6077 3050.4396 3105.2098 3417.8999 3471.6274 3523.2501 3537.0008 3591.9325 3616.4842
redmass: 6.6837 7.0829 7.0240 7.0466 6.0442 5.3021 3.6068 7.5724 4.2490 2.7625 2.5214 5.1932 4.2965 3.8434 3.3131 5.0081 2.6719 2.7332 7.3092 4.2450 1.7039 2.3779 2.3980 6.1670 1.8301 4.6233 1.3429 1.2398 3.0096 2.0830 1.6149 4.4261 8.1397 9.2487 6.8877 3.6511 5.0901 2.6320 3.5879 3.6874 7.1087 2.9309 1.3436 1.3231 3.5605 2.5981 2.0991 2.9189 6.9658 3.7051 2.3712 1.0880 1.1489 1.1739 1.1516 1.2129 1.3934 1.1610 1.3175 1.3026 1.2606 1.3158 1.3281 1.4875 1.9077 1.0833 1.0872 7.6475 1.0691 1.0823 1.0820 1.0837 1.0561 1.0892 1.1102 1.0642 1.0647 1.0647 1.0655 1.0663 1.0666
irintensity: 1.6984 0.5703 0.9966 0.5757 1.1050 1.7561 11.5167 4.5854 10.1492 47.4119 32.5632 11.2951 0.9520 11.0363 38.9420 29.5553 19.1458 83.3275 55.4744 85.8126 93.8486 70.7603 25.8586 14.3821 28.3149 6.0288 104.5432 178.3163 26.1514 94.0224 86.6621 10.8061 47.1503 251.2226 149.0319 44.1108 50.1998 33.9391 53.4479 107.2681 169.7918 76.3752 22.0009 121.5887 85.6741 84.7740 25.1246 36.1947 208.5697 10.9814 9.3705 51.4239 32.2792 44.0007 38.3960 26.9435 93.3021 10.7413 25.6671 32.5383 21.7136 9.0928 67.9208 20.5743 1.0866 25.3579 16.5477 92.1716 40.9809 25.2144 6.7119 43.8238 17.1448 2.9312 10.3667 48.7182 21.3183 21.5369 34.3968 74.8830 81.1624
temp: 298.150 k
press: 1.00000 atm
elementType: 15 8 8 8 8 8 8 8 8 8 6 6 6 6 6 6 1 1 1 1 1 1 1 1 1 1 1 1 1
symmnumber: 1
zpe: 548741.7 jmol-1
zpe.correction: 0.209005 hartree
zpe.thermalcorrener: 0.228649 hartree
zpe.thermalcorrenthalpy: 0.229593 hartree
zpe.thermalcorrgfe: 0.158522 hartree
zpe.sumelectzpe: -1253.328750 hartree
zpe.sumelectthermal: -1253.309106 hartree
zpe.sumelectthermalent: -1253.308161 hartree
zpe.sumelectthermalfe: -1253.379233 hartree
dipole: 2.6195 -2.9795 1.6505
dipole: 4.2969
quadrupole: -102.5868 -113.3192 -100.4494
quadrupole: -5.3300 6.8194 3.2248
quadrupole: 2.8650 -7.8674 5.0024 -5.3300 6.8194 3.2248
hfenergy: -1253.5377548 hartree
pointgroup: C01 [X(C6H13O9P1)]
dipole: -1.0830443 -1.0585215 -0.75129 debye
polarizability: 152.2074243|-6.873023|116.0298293|-6.527628|3.6535578|93.9830535 unknown
InChI: InChI=1S/C6H13O9P/c7-1-3(8)5(10)6(11)4(9)2-15-16(12,13)14/h4-7,9-13H,1-2H2
charge 0 multiplicity 1
29 atoms
P  -4.066978 0.373254 0.282294
O  0.994157 -1.44086 -1.456187
O  0.121844 0.269663 1.662948
O  -2.374178 0.433043 0.490202
O  3.099487 -2.262567 0.22845
O  4.338629 -0.031108 -0.418713
O  3.677028 2.573309 -0.066329
O  -4.360141 -1.199157 0.891191
O  -4.342644 0.063777 -1.398762
O  -4.823153 1.621399 0.884551
C  0.950046 -1.274168 -0.004827
C  -0.085673 -0.177052 0.280724
C  2.374717 -1.033409 0.558263
C  -1.504657 -0.718356 0.092028
C  3.168732 0.168462 0.031037
C  2.630425 1.586243 0.097252
H  0.626134 -2.217907 0.485784
H  0.053895 0.665298 -0.426284
H  2.289948 -0.901306 1.657384
H  -1.690099 -0.999157 -0.958971
H  -1.718945 -1.563404 0.769296
H  1.684285 -2.134266 -1.633409
H  -0.676887 0.798298 1.925787
H  1.872747 1.684708 -0.714058
H  2.107898 1.752536 1.056238
H  4.026325 -1.992567 -0.033186
H  4.45588 2.119775 -0.49253
H  -5.271846 -1.559316 0.756457
H  -4.542375 0.871837 -1.937428
