program: Gaussian 09
title: 000151195
version: EM64L-G09RevD.01
frameworkgroup: C1[X(C21H27N3O2)]
method: RPBEPBE
basis: SDD
operation: Freq
keyword: #p
keyword: freq=noraman
keyword: PBEPBE/SDD
title: #p freq=noraman PBEPBE/SDD
converged: YES YES NO NO
title: Mulliken charges:
elementType: O O N N N C C C C C C C C C C C C C C C C C C C C C H H H H H H H H H H H H H H H H H H H H H H H H H H H
charge: -0.257633 -0.436178 -0.114906 -0.157205 -0.364330 -0.169175 0.382358 -0.591754 -0.263037 -0.475921 0.358734 -0.186079 0.226395 -0.423693 0.265928 -0.454945 -0.642628 -0.431519 0.207799 -0.374977 -0.211974 -0.632419 -0.390156 -0.344752 -0.385558 -0.325766 0.210368 0.215053 0.243119 0.229027 0.215974 0.238747 0.237624 0.261117 0.222727 0.233573 0.191135 0.230203 0.231005 0.214450 0.229697 0.237451 0.236681 0.297605 0.249736 0.213232 0.183709 0.234274 0.226754 0.178606 0.180635 0.222324 0.328567
chargesum: 0.00000
title: Mulliken charges with hydrogens summed into heavy atoms:
elementType: O O N N N C C C C C C C C C C C C C C C C C C C C C
charge: -0.257633 -0.107611 -0.114906 -0.157205 -0.066725 0.041193 0.382358 -0.133582 -0.034010 -0.021200 0.358734 -0.186079 0.226395 -0.186069 0.265928 -0.193828 0.004807 -0.201316 0.207799 -0.143972 0.002476 0.071410 0.072812 0.073231 0.019802 0.077193
polarizability: 3.83095096e+02 -2.55336963e+00 2.59818117e+02 4.02796643e+00 -5.52027363e+00 1.58651252e+02
1716.lowfreq: -8.2503 -4.0819 -0.0012 0.0007 0.0012 3.9397 14.4982 17.1130 31.5385
frequency: 13.9442 17.0176 31.4867 33.5976 50.3107 52.9498 66.0397 76.7117 86.7855 99.9600 134.9152 139.0010 144.7998 153.6175 172.7083 201.5347 203.6732 228.7010 236.2402 252.5656 266.5231 284.9964 295.3904 312.4965 316.6589 322.2288 349.5239 379.6293 392.4664 394.3284 448.3805 461.0161 489.5910 515.2461 532.8819 543.2690 548.8206 561.2408 598.0120 605.8047 611.2224 642.8818 669.7920 679.0973 721.2613 739.4067 748.4462 760.4121 774.1190 787.0625 792.4189 804.3572 814.2300 847.8879 867.8462 880.7473 895.5036 932.1316 947.5036 950.3528 953.9184 970.5244 991.5414 1003.9177 1017.7197 1038.0566 1042.0939 1043.7380 1051.9921 1065.8177 1067.7671 1075.6461 1096.6908 1101.4710 1107.3483 1117.7458 1139.2902 1146.6754 1158.4172 1162.3894 1175.3342 1185.7801 1193.5353 1198.6474 1224.0009 1236.2917 1239.4735 1255.7271 1261.5059 1265.7003 1282.2964 1286.5766 1295.4256 1296.1839 1307.6039 1311.4724 1315.2304 1318.2650 1349.6083 1351.0001 1363.7430 1369.1548 1371.4857 1383.2783 1386.3281 1419.8489 1432.1391 1435.2127 1446.7506 1460.4679 1465.6015 1466.6075 1471.1652 1472.3054 1477.4811 1478.3034 1483.2092 1484.0831 1485.3233 1486.9761 1498.3690 1564.6853 1610.6138 1615.4247 1619.1990 1658.6686 2802.1244 2860.1310 2912.0084 2942.0702 2945.1938 2954.9048 2972.8923 2974.7191 2980.2762 2996.0998 3025.9922 3033.8618 3037.7153 3044.4208 3047.8722 3050.2649 3072.1710 3078.6369 3089.4976 3103.4013 3106.0871 3123.8117 3140.3484 3156.9625 3210.4022 3549.5768 3557.3411
redmass: 5.7207 5.6681 4.7122 4.0169 2.0661 1.2301 2.6305 5.5342 3.5137 2.6145 2.1350 2.7849 4.4606 2.8572 3.4229 2.2229 1.9368 3.4715 3.2327 3.3863 3.1461 3.0029 3.0608 1.2161 3.9162 3.6996 3.5027 4.3027 4.3433 3.7200 4.0669 3.9987 3.5134 3.4849 3.7928 1.3781 4.5819 3.4388 3.5113 3.7157 3.9400 3.8633 3.5777 3.4492 4.6899 1.6171 1.6094 1.6139 1.7664 3.1555 2.3671 1.5920 3.4484 1.5990 3.1809 1.4331 2.7418 2.5041 2.0910 2.7605 1.5139 2.4676 2.2463 2.5174 4.0582 2.1150 2.3215 3.4267 3.3681 2.2141 2.1779 2.8564 2.8210 1.6513 1.3556 1.3034 1.7986 2.4334 1.5384 1.4870 1.4935 1.3045 1.7139 1.4937 2.2482 1.9015 1.3189 1.3913 1.5633 1.6292 1.6468 1.0921 1.3431 1.5682 1.1317 2.4370 1.3238 1.3951 1.8735 1.3307 2.5987 1.3770 1.5025 1.2520 3.5894 5.9777 1.5345 1.1932 1.1307 1.1128 1.0726 1.0437 1.1525 1.1135 1.1061 2.1163 1.5200 1.0808 1.6990 1.2007 1.4953 6.8407 7.8650 6.5782 8.4571 8.6747 1.0785 1.0571 1.0688 1.0805 1.0698 1.0643 1.0357 1.0627 1.0629 1.0629 1.0907 1.0750 1.0916 1.0980 1.1019 1.0965 1.1016 1.0996 1.0994 1.0983 1.0904 1.0855 1.0915 1.0982 1.0978 1.0778 1.0661
irintensity: 1.4227 0.0840 1.7414 7.1552 1.7356 0.8131 2.1593 1.6375 4.4982 4.8704 4.6135 2.7184 1.1199 4.1883 1.4647 1.1929 1.4916 0.6122 2.0130 0.9505 2.4597 10.3605 0.3554 133.4083 4.1729 3.3092 33.5542 2.4067 18.4547 4.8109 0.3928 2.3266 3.2821 6.5527 1.0795 82.7842 13.1363 12.4396 1.3447 2.8592 1.2715 1.5521 4.7194 11.0245 1.0494 19.7587 33.5552 28.3818 44.5704 1.9439 1.5106 6.9413 7.2471 10.8179 11.2703 1.0758 8.0130 29.0212 7.5022 36.6950 2.9394 3.6402 23.2077 0.6790 32.9825 81.5120 40.1610 1.3794 5.9670 7.5135 8.2098 17.6983 3.9091 29.9491 4.7336 0.9215 13.7955 6.2479 14.3166 4.8387 0.3501 4.1715 87.1882 11.6314 8.8516 9.1206 25.4999 16.8106 73.5971 0.7188 9.1192 1.5538 11.8725 6.5932 25.2611 68.3970 2.1433 12.4368 8.5023 8.8991 15.8617 2.0431 6.1841 29.1572 13.1525 17.9655 13.9725 3.6713 32.5120 3.8613 0.5839 13.7370 27.9511 17.0279 28.2980 97.0795 134.7402 26.4483 9.1243 74.3735 6.6341 7.4374 5.3218 121.0824 18.6513 1.5533 52.9964 123.3411 47.6520 44.8967 63.8842 31.4489 105.1119 31.4419 30.5062 46.9384 15.5484 24.7642 60.0708 17.4754 29.4774 38.0774 3.6170 69.0093 32.5935 11.9917 16.5463 2.9061 15.6661 32.0156 1.5556 16.1779 7.5501
temp: 298.150 k
press: 1.00000 atm
elementType: 8 8 7 7 7 6 6 6 6 6 6 6 6 6 6 6 6 6 6 6 6 6 6 6 6 6 1 1 1 1 1 1 1 1 1 1 1 1 1 1 1 1 1 1 1 1 1 1 1 1 1 1 1
symmnumber: 1
zpe: 1164919.7 jmol-1
zpe.correction: 0.443695 hartree
zpe.thermalcorrener: 0.469269 hartree
zpe.thermalcorrenthalpy: 0.470214 hartree
zpe.thermalcorrgfe: 0.385072 hartree
zpe.sumelectzpe: -1129.189807 hartree
zpe.sumelectthermal: -1129.164232 hartree
zpe.sumelectthermalent: -1129.163288 hartree
zpe.sumelectthermalfe: -1129.248430 hartree
dipole: 3.7318 -0.4892 -4.2774
dipole: 5.6976
quadrupole: -138.5078 -141.5794 -161.5431
quadrupole: 8.8826 25.2013 3.2569
quadrupole: 8.7023 5.6307 -14.3330 8.8826 25.2013 3.2569
hfenergy: -1129.6335018 hartree
pointgroup: C01 [X(C21H27N3O2)]
dipole: 1.4713706 0.0323648 1.6908008 debye
polarizability: 383.1504591|0.3204912|260.0013483|-4.0601507|2.3707223|158.4126566 unknown
InChI: InChI=1S/C21H27N3O2/c1-23-12-14-11-19-17(16-6-5-7-18(23)20(14)16)10-15(13-24(19)2)21(26)22-8-3-4-9-25/h5-7,10,12,15,19,22,25H,3-4,8-9,11,13H2,1-2H3
charge 0 multiplicity 1
53 atoms
O  -2.990865 -0.107584 -1.418413
O  -9.723274 0.901339 -0.276886
N  0.292462 -2.598459 -0.136639
N  5.680076 0.223327 0.134551
N  -3.480651 0.399838 0.795444
C  1.402969 -1.636696 -0.385478
C  1.008352 -0.199934 0.029923
C  2.712301 -2.133761 0.329158
C  -1.416281 -0.871277 0.339647
C  -1.027923 -2.063024 -0.553503
C  3.797763 -1.092739 0.216945
C  3.416102 0.281055 0.068935
C  2.103956 0.801736 -0.004019
C  -0.266663 0.120859 0.389504
C  4.586101 1.094815 0.026522
C  5.19127 -1.104076 0.247146
C  0.538217 -3.927284 -0.737463
C  1.992235 2.207205 -0.130218
C  -2.69098 -0.179095 -0.187657
C  4.472293 2.499637 -0.091133
C  3.159361 3.027494 -0.166126
C  7.086426 0.624799 0.125658
C  -4.712775 1.13899 0.472301
C  -5.973697 0.242398 0.460119
C  -7.249106 1.043719 0.113681
C  -8.507007 0.156152 0.087763
H  1.639293 -1.589592 -1.484459
H  3.034765 -3.09288 -0.11297
H  2.452486 -2.331924 1.388343
H  -1.615792 -1.249716 1.366079
H  -1.774878 -2.870652 -0.447884
H  -1.046435 -1.728175 -1.617147
H  -0.49723 1.14397 0.715865
H  5.890409 -1.933924 0.342402
H  -0.331866 -4.578157 -0.541769
H  1.419111 -4.407816 -0.281214
H  0.697222 -3.886453 -1.844939
H  1.008897 2.679061 -0.235139
H  5.343339 3.162434 -0.129889
H  3.034894 4.111644 -0.270607
H  7.723381 -0.267142 0.238131
H  7.353407 1.12439 -0.824619
H  7.307828 1.316379 0.960199
H  -3.222729 0.269008 1.774931
H  -4.572099 1.582618 -0.529497
H  -4.835652 1.962447 1.201945
H  -6.091649 -0.246422 1.449312
H  -5.821073 -0.562418 -0.283894
H  -7.136457 1.526942 -0.876153
H  -7.389912 1.858762 0.856871
H  -8.636113 -0.354349 1.067871
H  -8.418346 -0.616551 -0.694473
H  -9.858062 1.631281 0.379343
