program: Gaussian 09
title: 000151190
version: EM64L-G09RevD.01
frameworkgroup: C1[X(C15H32O3S)]
method: RPBEPBE
basis: SDD
operation: Freq
keyword: #p
keyword: freq=noraman
keyword: PBEPBE/SDD
title: #p freq=noraman PBEPBE/SDD
converged: YES YES NO NO
title: Mulliken charges:
elementType: S O O O C C C C C C C C C C C C C C C H H H H H H H H H H H H H H H H H H H H H H H H H H H H H H H H
charge: 1.027349 -0.401929 -0.519626 -0.531231 -0.387275 -0.385526 -0.385262 -0.386874 -0.385701 -0.382570 -0.381585 -0.377862 -0.373405 -0.325644 -0.353122 -0.612908 -0.356996 -0.696397 -0.489331 0.194521 0.194262 0.196358 0.195823 0.194401 0.194200 0.195905 0.196488 0.193322 0.193216 0.201419 0.203167 0.192175 0.192255 0.204445 0.204239 0.189450 0.189443 0.242138 0.230665 0.187762 0.187785 0.286629 0.291316 0.194743 0.194758 0.209713 0.209706 0.215122 0.243215 0.250544 0.236709
chargesum: 0.00000
title: Mulliken charges with hydrogens summed into heavy atoms:
elementType: S O O O C C C C C C C C C C C C C C C
charge: 1.027349 -0.401929 -0.519626 -0.531231 0.001508 0.006655 0.003338 0.005519 0.000837 0.022016 0.002846 0.030822 0.005489 0.147159 0.022426 -0.034963 0.032505 -0.061857 0.241137
polarizability: 2.91389859e+02 -6.18837255e+00 1.72281962e+02 1.14734088e+00 -8.06812504e-01 1.63373171e+02
1716.lowfreq: -1.4008 -0.0027 -0.0008 0.0013 6.1960 10.3414 16.0733 17.0617 29.0728
frequency: 16.0000 16.9022 28.6958 42.7303 45.3771 48.7992 54.0687 67.7539 77.2883 83.7519 93.1642 105.7570 110.0401 120.1308 125.8858 129.3470 138.7047 145.3822 159.3667 162.7406 176.0354 205.6756 216.5727 226.3710 231.7633 261.9212 282.7733 328.4842 332.9889 351.6434 411.2380 426.8393 448.4113 491.1057 495.4288 527.8955 608.6024 722.4750 723.9064 727.0751 734.4839 748.1399 764.9712 789.4007 825.2908 841.7146 867.7396 887.2824 910.0824 931.1410 940.1625 967.5973 975.0919 982.0714 1001.5490 1004.3788 1019.0749 1033.9708 1035.1869 1053.4724 1061.3513 1073.8436 1079.0719 1081.0393 1081.8395 1088.2081 1091.2498 1108.7379 1118.4870 1123.6749 1180.8362 1195.2358 1200.2174 1215.7381 1222.2395 1237.9710 1240.4795 1259.5371 1260.5359 1277.8699 1279.8938 1282.4696 1286.3479 1291.0590 1294.8031 1299.4092 1302.7995 1304.3614 1305.8280 1324.2721 1340.4719 1348.8689 1353.8674 1354.5889 1357.8452 1358.3484 1389.4779 1411.3307 1414.9214 1443.6865 1460.9095 1460.9478 1463.5277 1463.7318 1465.7650 1467.5516 1470.8012 1474.7439 1476.6177 1476.7341 1479.0145 1483.2520 1487.0121 1489.7701 1491.0127 2950.3140 2950.5000 2952.0571 2952.7295 2954.1938 2956.7288 2960.3937 2963.2340 2966.1073 2969.4642 2971.4742 2972.3415 2972.4184 2983.3892 2986.1529 2990.0183 2995.1229 2998.1903 3001.5168 3008.2971 3016.0877 3025.0561 3033.6425 3041.0183 3046.1962 3052.5671 3064.8264 3068.9595 3070.8865 3077.0742 3098.6505 3143.9136
redmass: 4.5456 4.4660 4.0428 3.6213 3.0828 2.2015 3.5121 1.9249 2.3496 3.9435 1.8480 5.6761 2.1594 1.8926 1.2776 2.5938 2.0053 2.0393 2.0192 2.0453 3.8958 4.5007 4.2028 1.1343 4.3563 3.6636 6.9942 4.7787 3.7546 5.5171 3.4897 3.7678 4.2391 3.1306 3.4107 7.5780 5.9639 1.0587 1.0646 1.0739 1.0913 1.1073 1.1398 1.1964 1.2589 12.8457 1.2869 1.9051 1.4145 9.3028 2.1886 1.4438 5.4760 4.9537 4.1837 1.2215 3.9306 3.2778 1.1163 3.2874 2.9504 2.5479 2.2559 2.2470 2.2500 2.0573 1.4798 1.3277 1.3120 2.8919 1.9371 1.6836 1.2380 1.4977 1.2666 1.3731 1.2754 1.2971 1.2807 1.2158 1.0207 1.2912 1.0331 1.1327 1.0887 1.0918 1.1144 1.3112 1.1073 1.3573 1.3973 1.4598 1.5741 1.6910 1.6328 1.6092 1.2174 1.1168 1.1043 1.0494 1.0729 1.0729 1.0698 1.0698 1.0653 1.0758 1.0801 1.0825 1.0423 1.0558 1.0856 1.0907 1.0946 1.0965 1.0999 1.0585 1.0585 1.0589 1.0590 1.0592 1.0594 1.0592 1.0589 1.0587 1.0586 1.0285 1.0370 1.0580 1.0960 1.0969 1.0981 1.0996 1.0595 1.1009 1.1024 1.1040 1.1049 1.1050 1.1048 1.1046 1.0560 1.1047 1.1007 1.0993 1.1049 1.1032 1.1104
irintensity: 0.0925 0.3017 0.1013 0.6251 1.8060 0.1227 6.3796 0.4197 0.0760 1.0584 0.1453 1.8820 0.0408 0.0393 0.2606 0.8664 0.0264 0.0153 0.0238 0.0097 10.9841 11.4159 1.5195 0.0004 1.8234 0.3569 9.7314 13.2845 4.3791 6.1374 4.3202 17.3489 18.3576 1.8004 18.5997 97.2252 2.1642 16.8871 1.3559 9.8968 0.3807 4.7834 0.2885 0.9005 2.1314 60.9880 1.5379 4.9876 14.0579 79.6191 42.8597 22.7747 0.1898 1.4806 0.2376 3.5409 8.2849 2.7729 2.3003 0.2621 1.3932 0.0486 0.2471 0.0723 0.0467 3.3797 9.8706 11.1880 6.3107 14.0253 0.2872 0.1314 33.3088 0.5258 0.5198 0.5473 2.8216 0.6291 4.2286 0.2913 0.1401 4.2920 0.0149 0.1230 0.1920 0.1223 0.0420 3.9708 0.0240 4.9739 4.6486 5.2014 0.5002 0.1211 0.3308 0.3657 11.3611 4.8717 6.4431 15.5487 0.0018 0.0054 0.3328 0.0124 0.5519 0.3573 1.8154 0.0705 12.3712 23.6981 1.6059 0.4401 1.8053 1.9334 52.6858 0.0030 0.0628 0.0380 0.3893 0.0010 2.0105 0.1043 9.4321 49.7953 167.4548 49.3531 29.7918 164.3765 0.0084 0.0280 0.0439 0.1063 17.9627 0.3351 0.1371 0.8446 0.5545 6.5290 27.3858 293.5536 5.4074 51.4136 100.2949 55.5079 25.0674 14.4294 1.6838
temp: 298.150 k
press: 1.00000 atm
elementType: 16 8 8 8 6 6 6 6 6 6 6 6 6 6 6 6 6 6 6 1 1 1 1 1 1 1 1 1 1 1 1 1 1 1 1 1 1 1 1 1 1 1 1 1 1 1 1 1 1 1 1
symmnumber: 1
zpe: 1175508.2 jmol-1
zpe.correction: 0.447727 hartree
zpe.thermalcorrener: 0.474281 hartree
zpe.thermalcorrenthalpy: 0.475225 hartree
zpe.thermalcorrgfe: 0.386071 hartree
zpe.sumelectzpe: -1212.755611 hartree
zpe.sumelectthermal: -1212.729057 hartree
zpe.sumelectthermalent: -1212.728113 hartree
zpe.sumelectthermalfe: -1212.817267 hartree
dipole: -2.4804 -3.2421 0.2627
dipole: 4.0905
quadrupole: -142.4742 -134.8027 -133.2511
quadrupole: -22.0932 1.1425 -0.2282
quadrupole: -5.6315 2.0400 3.5916 -22.0932 1.1425 -0.2282
hfenergy: -1213.2033379 hartree
pointgroup: C01 [X(C15H32O3S1)]
dipole: -0.9688725 1.2818662 -0.0899752 debye
polarizability: 291.4577775|5.5922338|172.2419512|-0.4743919|-0.6506812|163.3452626 unknown
InChI: InChI=1S/C15H32O3S/c1-3-4-5-6-7-8-9-10-11-12-13-14-15-19(16,17)18-2/h3-15H2,1-2H3
charge 0 multiplicity 1
51 atoms
S  7.116716 -0.509881 0.045038
O  8.267313 0.91683 0.478972
O  7.028432 -1.571338 1.26434
O  7.503213 -1.038563 -1.440975
C  -2.15918 0.536031 0.014523
C  -0.857594 -0.296949 0.006626
C  -3.43757 -0.332097 0.001941
C  0.423529 0.567468 0.01771
C  -4.742472 0.495689 0.008743
C  1.719298 -0.274179 0.007389
C  -6.018552 -0.37594 -0.004263
C  3.002355 0.588832 0.015558
C  -7.325742 0.448504 0.002346
C  4.284261 -0.284403 0.00577
C  -8.600397 -0.425224 -0.011295
C  5.534145 0.593639 0.008217
C  -9.908791 0.398197 -0.003349
C  -11.175974 -0.484057 -0.017862
C  9.673531 0.636868 0.130723
H  -2.170134 1.191553 0.910465
H  -2.167207 1.212734 -0.865562
H  -0.850859 -0.973167 0.886903
H  -0.848968 -0.953052 -0.888782
H  -3.429201 -1.008783 0.88206
H  -3.425578 -0.988355 -0.893495
H  0.41646 1.243797 -0.862464
H  0.416052 1.221979 0.914204
H  -4.755945 1.151665 0.904398
H  -4.752064 1.172362 -0.871417
H  1.724005 -0.928831 -0.888356
H  1.72625 -0.949039 0.887879
H  -6.004546 -1.032229 -0.899688
H  -6.008518 -1.052726 0.875811
H  2.99905 1.260536 -0.866957
H  3.001579 1.241052 0.912656
H  -7.3408 1.104271 0.898213
H  -7.336398 1.125579 -0.877566
H  4.290096 -0.944228 0.893861
H  4.27854 -0.935336 -0.889616
H  -8.587195 -1.080566 -0.907494
H  -8.590626 -1.103041 0.868065
H  5.680578 1.193635 -0.903498
H  5.648509 1.210855 0.913672
H  -9.91753 1.075595 -0.881745
H  -9.921424 1.052095 0.892648
H  -11.204539 -1.149832 0.865468
H  -11.201899 -1.124439 -0.919852
H  -12.097348 0.127064 -0.010542
H  10.162696 1.625135 0.164768
H  9.754098 0.218205 -0.890188
H  10.141541 -0.043015 0.864799
