program: Gaussian 09
title: 000151183
version: EM64L-G09RevD.01
frameworkgroup: C1[X(C20H17F3N2O4S)]
method: RPBEPBE
basis: SDD
operation: Freq
keyword: #p
keyword: freq=noraman
keyword: PBEPBE/SDD
title: #p freq=noraman PBEPBE/SDD
converged: YES YES NO NO
title: Mulliken charges:
elementType: S F F F O O O O N N C C C C C C C C C C C C C C C C C C C C H H H H H H H H H H H H H H H H H
charge: 0.229197 -0.165188 -0.165959 -0.168057 -0.258730 -0.199418 -0.281106 -0.145138 -0.330267 -0.362799 -0.556572 -0.583296 0.506207 -0.538248 0.160608 0.270771 -0.389087 0.173363 -0.360258 0.153692 -0.558488 -0.084527 0.509562 -0.406536 -0.346376 0.296923 -0.367636 -0.326220 0.261684 -0.530637 0.262080 0.243363 0.328028 0.267689 0.243279 0.258123 0.368611 0.263986 0.232686 0.323428 0.241965 0.273678 0.266642 0.261430 0.275800 0.217504 0.234241
chargesum: 0.00000
title: Mulliken charges with hydrogens summed into heavy atoms:
elementType: S F F F O O O O N N C C C C C C C C C C C C C C C C C C C C
charge: 0.229197 -0.165188 -0.165959 -0.168057 -0.258730 -0.199418 -0.281106 -0.145138 0.038344 -0.039370 -0.051129 -0.255267 0.506207 -0.270558 0.160608 0.270771 -0.145807 0.173363 -0.102134 0.153692 -0.061816 -0.084527 0.509562 -0.164571 -0.072698 0.296923 -0.100994 -0.064790 0.261684 0.196908
polarizability: 3.45747004e+02 -5.05715494e+00 2.87966092e+02 1.36608292e+01 -2.60250553e+01 1.64343159e+02
1716.lowfreq: -18.0264 -6.9715 -2.2676 -0.0006 -0.0003 0.0013 3.2388 6.4696 11.8146
frequency: -17.8721 4.4814 11.7710 18.5669 24.5209 36.4637 38.8413 50.9875 58.3664 76.7798 81.1192 111.0916 126.3633 147.8538 157.8193 162.1066 174.8812 206.7193 208.6482 229.3439 248.3920 257.4123 284.6143 299.8824 321.4890 337.3180 344.5108 355.6353 374.8530 380.7567 392.1296 401.4775 418.7419 434.8304 451.5423 471.8631 494.7330 497.1072 515.7962 547.5318 559.6239 563.6484 569.4712 589.8396 596.5079 611.1891 621.8558 632.2659 652.2007 659.3105 679.0922 692.8546 715.6686 734.7318 745.1196 752.7059 758.7285 768.9856 806.4489 838.5476 856.5763 860.1359 885.1061 898.3497 920.7210 946.9200 967.2787 970.6548 975.0292 981.6312 985.7119 990.0378 992.6702 1014.3143 1026.1236 1026.9793 1032.9860 1102.5490 1118.4158 1127.6129 1131.6691 1134.7246 1153.1847 1161.1876 1196.7176 1210.7316 1216.6723 1218.0774 1233.2052 1240.2733 1257.3648 1261.2711 1268.9756 1281.8854 1285.2941 1317.9899 1321.4261 1353.8828 1354.6051 1382.9177 1389.7751 1398.0708 1411.2104 1438.0094 1449.2160 1456.8016 1463.2876 1473.7882 1478.1535 1489.4034 1507.2860 1567.1714 1583.0181 1588.6630 1621.9996 1624.9862 1653.0822 1689.7222 2974.8434 2999.4047 3010.1425 3051.1254 3067.7411 3073.2462 3085.5058 3125.6147 3126.0548 3128.6505 3131.4495 3141.8221 3162.5535 3171.2560 3171.7872 3529.4099 3544.9618
redmass: 17.3674 9.8533 6.9762 7.8790 7.6921 4.8804 6.0407 6.8193 7.4284 7.4534 5.0843 6.1736 4.8673 8.2444 9.4320 5.7088 7.0827 3.7803 5.7791 2.4210 4.8873 5.6391 1.8996 4.1545 6.6238 4.1872 8.5346 4.0614 4.7298 4.3457 3.6972 2.8715 5.0348 12.7824 6.6646 4.6348 5.1546 5.0321 10.3520 3.8080 5.2142 3.9841 3.0386 1.9836 4.5164 4.4648 5.0098 6.7960 5.5893 4.0718 6.4071 4.0696 4.8977 3.1878 2.6930 3.0283 4.5664 4.0791 3.6322 1.4993 1.4597 1.4933 3.6737 1.8701 2.3149 2.0759 1.6378 1.4253 3.8978 3.9173 3.6871 1.5904 6.8717 4.0227 4.1500 3.5371 3.6231 2.4547 1.2955 4.1944 1.4073 1.3819 1.2219 1.3061 1.1286 2.1971 1.5259 1.9168 2.8015 1.5949 1.9252 2.1634 2.0070 3.0704 2.2041 1.2767 1.3801 1.3158 1.6203 5.2812 6.0407 2.7837 2.8149 1.3704 1.1738 1.0553 1.1048 1.1385 1.5730 2.4638 2.5780 6.6549 6.3533 6.8962 6.5347 6.2667 7.6494 12.2603 1.0337 1.0598 1.0597 1.0891 1.0980 1.1034 1.0989 1.0904 1.1048 1.0909 1.0902 1.0892 1.0969 1.0948 1.0954 1.0781 1.0784
irintensity: 0.0694 0.0922 0.1343 1.4102 0.6948 0.4588 0.9331 0.4012 1.9034 1.0987 3.8023 3.0119 5.6879 3.5346 10.6875 3.3194 2.3883 0.9064 2.1550 0.9592 1.3581 3.4517 7.5582 0.4056 14.2528 1.2052 6.5535 9.8804 0.7011 7.1408 4.4262 0.2805 2.5918 14.1132 9.8471 3.0858 24.6170 2.2041 0.5743 29.7058 22.7180 13.0580 37.1957 58.0447 5.3070 23.6207 26.0836 2.9391 10.9384 37.7889 6.6783 7.0348 9.6042 27.7630 37.7039 44.0866 4.9404 9.4076 36.6116 42.4156 40.9281 54.9088 4.8675 1.5529 2.1119 16.6002 35.3499 2.8567 7.2558 100.7110 106.9502 26.3912 133.8170 50.4631 4.9237 73.7357 85.7957 22.3791 4.4607 146.0253 3.5012 7.4829 7.4623 10.3341 5.7101 47.0651 13.7417 44.2013 140.9595 47.7272 105.7092 72.1417 102.4552 404.4744 42.2857 6.3119 11.3378 8.7159 5.2552 32.8296 5.6923 4.4564 28.5298 2.6198 47.3312 23.2436 13.6663 76.2733 157.0971 108.3277 7.5904 22.9731 139.2558 1.1620 40.9378 45.0049 480.5458 332.3899 56.7785 11.1214 31.1870 1.0098 5.4629 5.0910 29.9071 7.4835 17.9740 10.0334 8.5530 0.4402 2.7420 5.0255 1.5929 72.3336 20.5243
temp: 298.150 k
press: 1.00000 atm
elementType: 16 9 9 9 8 8 8 8 7 7 6 6 6 6 6 6 6 6 6 6 6 6 6 6 6 6 6 6 6 6 1 1 1 1 1 1 1 1 1 1 1 1 1 1 1 1 1
symmnumber: 1
zpe: 889705.9 jmol-1
zpe.correction: 0.338871 hartree
zpe.thermalcorrener: 0.366048 hartree
zpe.thermalcorrenthalpy: 0.366993 hartree
zpe.thermalcorrgfe: 0.275113 hartree
zpe.sumelectzpe: -1878.195674 hartree
zpe.sumelectthermal: -1878.168497 hartree
zpe.sumelectthermalent: -1878.167553 hartree
zpe.sumelectthermalfe: -1878.259432 hartree
dipole: 3.5809 -0.7275 0.4489
dipole: 3.6815
quadrupole: -211.5244 -192.0596 -182.2842
quadrupole: -5.6241 -6.8364 -13.0906
quadrupole: -16.2350 3.2298 13.0052 -5.6241 -6.8364 -13.0906
hfenergy: -1878.5345451 hartree
pointgroup: C01 [X(C20H17F3N2O4S1)]
dipole: -1.4047641 -0.2799998 -0.2149226 debye
polarizability: 345.3635319|3.9367056|283.0072893|15.7640273|35.7972224|169.6854338 unknown
InChI: InChI=1S/C20H17F3N2O4S/c1-29-15-7-4-12(9-16-18(27)25-19(28)30-16)8-14(15)17(26)24-10-11-2-5-13(6-3-11)20(21,22)23/h2-8,16,24-25H,9-10H2,1H3
charge 0 multiplicity 1
47 atoms
S  -3.530258 -1.912382 0.457649
F  6.768965 -2.620112 1.148253
F  7.683218 -0.797633 0.155476
F  6.593353 -0.576269 2.124411
O  -0.187811 3.708489 1.355025
O  -7.371928 -0.811137 0.262814
O  0.866579 2.535285 -1.566326
O  -4.424317 -4.427082 -0.288764
N  -6.030745 -2.714408 -0.041891
N  0.476394 0.278538 -1.159152
C  -4.717427 0.588662 -0.366047
C  -4.933711 -0.627525 0.578427
C  -3.503869 1.416522 0.020431
C  -2.241346 1.169926 -0.55392
C  -1.069893 1.899211 -0.195843
C  -6.245396 -1.361775 0.264882
C  -3.602101 2.453703 0.986988
C  -1.190463 2.91475 0.803702
C  -2.468753 3.184879 1.367696
C  0.171959 1.626394 -1.005791
C  1.570256 -0.182086 -2.03679
C  -4.726727 -3.251241 -0.025039
C  2.863722 -0.478332 -1.281764
C  3.332725 -1.804615 -1.12765
C  3.613717 0.588566 -0.717677
C  5.255842 -1.003129 0.139925
C  4.524618 -2.073053 -0.420024
C  4.802654 0.331686 -0.0112
C  6.540121 -1.253044 0.87506
C  1.241213 3.390186 1.213213
H  -5.640552 1.196186 -0.304812
H  -4.632544 0.219857 -1.404475
H  -4.965066 -0.283852 1.626663
H  -2.159075 0.413237 -1.343225
H  -4.572898 2.690394 1.439311
H  -2.52693 3.976007 2.120996
H  -6.818243 -3.323379 -0.284757
H  1.73815 0.628304 -2.76851
H  1.230171 -1.081182 -2.581982
H  -0.023222 -0.408711 -0.591225
H  2.767045 -2.636457 -1.563701
H  3.260451 1.616523 -0.854443
H  4.880545 -3.100616 -0.301621
H  5.379045 1.156992 0.419282
H  1.604517 3.679462 0.214198
H  1.425346 2.311261 1.380793
H  1.732469 3.978602 2.002835
