program: Gaussian 09
title: 000151182
version: EM64L-G09RevD.01
frameworkgroup: C1[X(C17H26N2O)]
method: RPBEPBE
basis: SDD
operation: Freq
keyword: #p
keyword: freq=noraman
keyword: PBEPBE/SDD
title: #p freq=noraman PBEPBE/SDD
converged: YES YES NO NO
title: Mulliken charges:
elementType: O N N C C C C C C C C C C C C C C C C C H H H H H H H H H H H H H H H H H H H H H H H H H H
charge: -0.272609 -0.111397 -0.408174 -0.375934 -0.053256 -0.009398 -0.559584 0.429528 -0.718422 -0.704619 -0.685210 -0.743612 0.126776 0.221693 -0.439021 -0.585422 -0.318230 0.312857 -0.350103 -0.536776 0.195111 0.216382 0.230862 0.175738 0.189262 0.226189 0.212795 0.206764 0.222626 0.224817 0.208288 0.212106 0.193071 0.219769 0.236954 0.220517 0.214124 0.221036 0.268180 0.296080 0.245696 0.226202 0.245382 0.240589 0.215387 0.216988
chargesum: 0.00000
title: Mulliken charges with hydrogens summed into heavy atoms:
elementType: O N N C C C C C C C C C C C C C C C C C
charge: -0.272609 -0.111397 -0.112094 0.035559 0.177607 0.166340 -0.144133 0.429528 -0.076238 -0.059409 -0.035416 -0.087935 0.126776 0.221693 -0.170841 -0.339726 -0.092028 0.312857 -0.104722 0.136187
polarizability: 2.52650262e+02 8.66966160e+00 2.05779571e+02 2.62624736e+01 -1.26303726e+00 1.55650618e+02
1716.lowfreq: -14.5022 -8.6159 0.0003 0.0005 0.0006 5.7114 17.2195 23.4343 38.4488
frequency: 15.6480 23.3644 38.3776 50.8094 84.1899 92.2246 106.6823 133.9226 152.6991 177.1093 186.1210 194.7705 204.0754 227.9581 246.2438 260.4588 277.5136 285.5787 293.6203 314.4244 352.0374 367.5430 384.4663 398.4851 415.1314 426.5236 443.0127 449.6661 473.9581 485.0971 497.8648 510.5325 540.3262 556.4602 597.2943 642.1819 658.3122 673.4588 742.3081 754.3121 783.3706 801.9477 803.3786 820.0688 839.8457 860.2413 894.7782 902.2794 909.3657 917.8722 922.9793 932.1579 932.7699 950.4980 979.6670 996.5637 1013.4674 1039.9988 1066.7923 1092.8855 1111.7964 1113.9914 1126.0276 1130.4613 1138.9231 1154.5000 1160.9396 1176.4021 1188.6865 1196.6434 1212.7503 1241.8198 1252.6895 1269.2059 1296.9796 1308.6577 1318.4484 1324.6027 1326.4876 1335.5877 1349.9343 1365.6024 1373.2338 1378.7445 1385.9603 1393.7105 1398.4758 1422.2692 1437.5914 1451.5690 1458.0944 1463.1994 1463.8406 1466.0603 1467.6497 1470.2135 1474.0385 1477.5166 1478.1843 1479.7339 1488.9037 1490.5822 1496.2483 1561.7127 1594.2670 1632.8772 2828.5185 2931.9662 2948.2437 2966.4586 2972.8858 2978.2466 2978.7213 2984.7929 3018.5745 3021.2127 3030.9907 3059.8947 3064.8392 3070.1112 3073.0499 3075.6501 3078.9111 3081.4252 3084.4351 3096.9497 3116.5157 3133.6062 3151.1890 3169.8012 3227.0069 3616.3506
redmass: 3.7610 3.6723 3.2609 3.0663 3.3975 3.6903 2.5610 3.7967 3.8984 2.8829 1.7535 1.0962 1.5460 2.0439 1.2516 2.7772 1.2399 1.2028 2.5520 2.2813 2.9977 3.1368 4.4512 2.3884 2.3229 2.7807 3.1426 2.4865 3.6379 1.4403 3.9986 2.4067 2.2883 3.2924 2.5397 4.3905 3.1889 2.7882 5.4832 3.1858 1.4862 1.9478 2.8063 2.7431 1.7231 2.5075 1.7297 4.3232 1.3739 1.3136 2.1576 1.3306 1.3797 1.4838 2.3021 4.2454 2.2742 2.4948 2.5323 1.5183 2.2748 1.2629 1.9784 1.3403 1.6826 1.5035 1.7284 2.0359 2.4917 2.4230 1.8697 2.5559 1.3871 1.3463 2.3197 1.4512 1.3419 1.5969 1.4049 1.3292 1.3026 1.2623 1.2767 1.2591 1.2233 1.2047 4.5469 1.7835 1.5566 1.0721 1.0977 2.5671 1.0591 1.0987 1.0565 1.0828 1.0522 1.8633 1.6111 1.0733 1.0544 1.0590 1.0575 6.2782 6.4230 7.0551 1.0808 1.0658 1.0334 1.0671 1.0355 1.0356 1.0357 1.0370 1.0857 1.0922 1.1033 1.0943 1.0984 1.0997 1.0993 1.0987 1.0989 1.0985 1.0995 1.0979 1.0986 1.0893 1.0906 1.0954 1.0984 1.0808
irintensity: 0.2225 0.0317 0.1277 0.0787 6.7412 2.3941 0.1185 4.2145 0.0731 1.2846 2.3170 0.1437 1.4408 0.5266 1.8958 2.9840 0.2269 0.3083 2.5159 1.3677 1.9464 2.2506 3.8921 0.7391 0.1839 6.2005 0.7576 1.8584 3.6765 73.7598 3.0278 30.3389 3.7226 3.8736 9.5574 9.7712 7.1348 4.3283 0.2042 0.5347 52.5035 30.6491 15.7708 1.7174 36.7261 5.0564 4.5746 25.1193 2.5099 2.8521 5.5215 0.1690 1.1393 0.3274 8.0919 40.0799 8.2134 16.0436 20.6150 29.9012 4.0501 0.1787 25.0086 4.3313 20.1421 13.2458 44.9554 17.5413 95.9214 39.9563 68.7036 23.1836 7.8753 5.9809 14.8091 39.7317 3.0749 9.9622 18.5399 4.5565 6.5735 20.3941 14.5838 11.9223 24.9161 18.5270 35.0526 30.4146 11.1216 6.5515 3.3389 57.9829 12.2725 6.7628 1.4779 6.8352 1.9348 35.8669 60.5118 2.9251 12.2119 24.6056 22.2163 2.0756 27.3214 34.6481 86.2283 40.7890 58.9217 64.2394 38.6866 30.9557 27.5860 20.5308 11.5430 17.1351 55.7251 36.8513 14.7045 41.3533 0.4071 49.5293 96.3178 66.8252 36.2303 28.5377 32.7211 14.1374 9.1866 10.0309 1.3966 57.3664
temp: 298.150 k
press: 1.00000 atm
elementType: 8 7 7 6 6 6 6 6 6 6 6 6 6 6 6 6 6 6 6 6 1 1 1 1 1 1 1 1 1 1 1 1 1 1 1 1 1 1 1 1 1 1 1 1 1 1
symmnumber: 1
zpe: 1042317.3 jmol-1
zpe.correction: 0.396998 hartree
zpe.thermalcorrener: 0.418394 hartree
zpe.thermalcorrenthalpy: 0.419338 hartree
zpe.thermalcorrgfe: 0.346053 hartree
zpe.sumelectzpe: -846.567456 hartree
zpe.sumelectthermal: -846.546060 hartree
zpe.sumelectthermalent: -846.545116 hartree
zpe.sumelectthermalfe: -846.618401 hartree
dipole: -2.1393 -0.3144 -0.1697
dipole: 2.1690
quadrupole: -127.7514 -101.6219 -125.8283
quadrupole: -0.2880 0.6153 -0.9668
quadrupole: -9.3508 16.7786 -7.4278 -0.2880 0.6153 -0.9668
hfenergy: -846.9644537 hartree
pointgroup: C01 [X(C17H26N2O1)]
dipole: -0.7824374 0.109734 -0.3223726 debye
polarizability: 227.6883822|-17.7827|201.8686078|47.6718033|7.6798728|184.5234615 unknown
InChI: InChI=1S/C17H26N2O/c1-12(2)19(13(3)4)9-8-14-11-18-17-7-6-15(20-5)10-16(14)17/h6-7,10-13,18H,8-9H2,1-5H3
charge 0 multiplicity 1
46 atoms
O  4.080709 0.259452 2.346408
N  -2.621108 0.684977 -0.432238
N  0.923275 -2.321377 -1.475979
C  -1.391654 1.508263 -0.260603
C  -3.753728 1.42228 -1.084741
C  -3.005131 -0.099175 0.794351
C  -0.269435 1.232511 -1.315119
C  0.408945 -0.106514 -1.196396
C  -3.360056 1.962475 -2.477176
C  -4.373975 2.557281 -0.213587
C  -1.904866 -1.11884 1.171786
C  -4.332485 -0.870907 0.604179
C  1.497559 -0.451388 -0.297051
C  1.799671 -1.843282 -0.492576
C  0.091758 -1.27205 -1.895961
C  2.242494 0.300842 0.655665
C  2.822848 -2.496007 0.231438
C  3.260683 -0.357216 1.374908
C  3.549188 -1.741683 1.167368
C  3.849316 1.677423 2.606695
H  -1.636648 2.591669 -0.314726
H  -0.971947 1.346249 0.750168
H  -4.543718 0.670582 -1.261672
H  -3.138766 0.591443 1.66867
H  0.486974 2.03948 -1.208919
H  -0.709163 1.342684 -2.321154
H  -2.604357 2.767318 -2.416042
H  -4.25083 2.383053 -2.979744
H  -2.955822 1.149548 -3.106069
H  -4.692969 2.177447 0.774271
H  -3.654389 3.380528 -0.046072
H  -5.26113 2.986993 -0.715377
H  -2.186334 -1.639424 2.106515
H  -1.788216 -1.866415 0.366866
H  -0.918871 -0.652404 1.331482
H  -5.216068 -0.212577 0.535876
H  -4.487334 -1.540791 1.469169
H  -4.283735 -1.495051 -0.307813
H  -0.676465 -1.427833 -2.650637
H  0.905738 -3.271041 -1.838984
H  2.023059 1.361783 0.80968
H  3.053149 -3.556231 0.078379
H  4.352501 -2.191765 1.758187
H  4.582832 1.955592 3.378331
H  2.823472 1.858046 2.986348
H  4.015731 2.289353 1.697395
