program: Gaussian 09
title: 000151173
version: EM64L-G09RevD.01
frameworkgroup: C1[X(C8H11N3O4)]
method: RPBEPBE
basis: SDD
operation: Freq
keyword: #p
keyword: freq=noraman
keyword: PBEPBE/SDD
title: #p freq=noraman PBEPBE/SDD
converged: YES YES NO NO
title: Mulliken charges:
elementType: O O O O N N N C C C C C C C C H H H H H H H H H H H
charge: -0.260172 -0.254345 -0.452890 -0.268429 -0.224918 -0.043363 -0.623520 -0.060083 -0.343382 -0.001431 -0.341154 -0.059469 0.043029 -0.377026 0.188650 0.294795 0.237508 0.264467 0.258048 0.229046 0.220021 0.326682 0.233522 0.356500 0.317778 0.340137
chargesum: 0.00000
title: Mulliken charges with hydrogens summed into heavy atoms:
elementType: O O O O N N N C C C C C C C C
charge: -0.260172 -0.254345 -0.096390 -0.268429 -0.224918 -0.043363 0.034396 0.234712 0.158593 0.256617 0.107913 0.267213 0.043029 -0.143504 0.188650
polarizability: 1.54186479e+02 1.39972389e+01 1.32937001e+02 -7.77682998e+00 3.20778025e+00 7.27673298e+01
1716.lowfreq: -13.8405 -10.1785 -0.8605 0.0006 0.0008 0.0010 47.0295 54.5169 78.0267
frequency: 46.7007 54.5098 77.9670 123.1249 142.8814 165.8172 191.3610 218.3021 234.9498 243.3582 288.3779 347.4888 370.5167 420.1076 428.1651 433.4218 464.0472 525.5351 561.3629 568.2492 586.0976 671.3268 695.9086 720.5650 736.9488 743.9082 755.5659 778.5951 784.7028 863.4312 915.1969 930.3640 938.4836 973.3302 987.9906 993.3655 1023.5732 1045.1896 1063.8416 1069.1313 1085.5989 1156.2881 1177.0924 1184.5781 1204.3854 1233.8905 1239.7564 1263.7589 1288.7229 1313.1076 1336.1478 1340.6406 1373.4001 1407.7356 1463.7762 1467.8904 1473.9126 1503.7848 1582.9764 1625.6319 1635.7083 2966.9870 3026.2680 3042.4087 3075.7934 3100.3139 3144.8290 3157.7759 3185.7581 3541.7150 3585.0769 3699.7805
redmass: 4.5066 6.5400 5.6834 3.3669 5.4128 4.0774 3.4608 5.6753 1.1634 4.5944 7.6040 3.3941 5.0838 6.3595 1.1972 2.9448 3.4908 5.1996 9.0330 1.1990 6.0224 4.0386 2.9316 6.4237 6.7741 5.3836 5.2728 1.8048 3.1344 4.1470 3.1825 3.9853 4.1588 3.0841 1.7231 3.5094 2.4672 2.5132 2.8900 2.6235 2.3380 1.2504 1.6016 1.1584 4.1985 1.1776 1.2347 1.2796 1.6228 1.3106 1.3799 1.2355 1.9127 1.4307 1.0792 1.3801 2.3879 4.5032 2.7557 1.8671 6.5024 1.0558 1.1053 1.0655 1.0879 1.0912 1.1041 1.0920 1.0982 1.0452 1.0669 1.1045
irintensity: 1.2637 8.4441 3.2601 11.6946 2.9814 3.7054 39.7138 6.4654 129.7820 11.9377 6.0000 2.9389 1.7763 6.4031 112.2259 54.8877 14.1141 7.3337 7.0625 136.8656 2.5042 4.8505 0.6793 6.9401 1.5259 16.8358 8.2973 74.6964 38.3863 68.9639 26.9393 69.0002 41.0558 48.3420 30.4919 29.6655 9.0952 88.4449 103.2138 32.3663 11.3396 9.7550 22.1209 17.4102 23.6260 12.2894 10.3202 25.8001 61.4822 30.5596 16.1534 5.6604 32.4720 2.9716 7.8976 53.6549 155.9338 114.7834 199.7275 138.4020 766.2605 35.1618 37.7705 28.0645 7.3172 33.7027 10.7156 17.0832 6.5012 104.9360 7.0420 37.9054
temp: 298.150 k
press: 1.00000 atm
elementType: 8 8 8 8 7 7 7 6 6 6 6 6 6 6 6 1 1 1 1 1 1 1 1 1 1 1
symmnumber: 1
zpe: 520789.8 jmol-1
zpe.correction: 0.198358 hartree
zpe.thermalcorrener: 0.212160 hartree
zpe.thermalcorrenthalpy: 0.213104 hartree
zpe.thermalcorrgfe: 0.157641 hartree
zpe.sumelectzpe: -775.440409 hartree
zpe.sumelectthermal: -775.426607 hartree
zpe.sumelectthermalent: -775.425663 hartree
zpe.sumelectthermalfe: -775.481126 hartree
dipole: 0.6057 6.8953 -1.5946
dipole: 7.1032
quadrupole: -75.4437 -86.6724 -88.4815
quadrupole: 11.4994 3.7252 -8.0964
quadrupole: 8.0888 -3.1399 -4.9490 11.4994 3.7252 -8.0964
hfenergy: -775.6387672 hartree
pointgroup: C01 [X(C8H11N3O4)]
dipole: 0.1976733 -2.7511622 -0.4493157 debye
dipolederiv: -1.0613496 -0.014846 0.1460882 0.2355521 -0.4918628 -0.0399103 0.0450506 -0.0296927 -0.487433 -0.7096465 0.116513 -0.0541512 0.1726535 -0.6499008 0.0852581 0.0924048 0.0791653 -0.4778498 -0.6429144 0.0138827 -0.0833308 0.0520001 -0.677562 0.2327039 -0.1158359 0.2670407 -0.2637162 -0.6302601 -0.1391782 -0.0128242 -0.1676025 -1.3235932 0.1065545 -0.0069636 0.1181322 -0.4012027 -0.8138442 0.1980498 -0.2205703 -0.580489 -1.0111812 -0.003287 -0.0292619 0.2678008 -0.2066753 -0.8023075 -0.4903526 -0.0566931 -0.5105299 -1.2499182 0.0031421 -0.0994306 -0.0113092 -0.331876 -1.2919584 -0.5996446 -0.0649831 -0.4936935 -0.5223277 -0.2113707 -0.1457977 -0.2842911 -0.6957866 1.1975911 0.1949411 0.0834591 0.0504124 0.4795945 0.1192193 0.3086478 0.1326268 0.3142986 0.5316933 -0.1644235 0.1152906 -0.1737008 0.2345089 0.0547362 -0.0155457 0.0391856 0.1983343 0.8433109 -0.0764387 -0.1267506 -0.1871641 0.7688696 0.0296679 -0.2760158 -0.0002397 0.6421444 0.3421731 -0.0530188 0.0178085 -0.0510537 0.4444744 -0.2473963 0.0786934 -0.2745421 0.1177121 0.3697643 0.1916425 0.0826279 0.8044148 0.6654961 0.0885513 -0.0320465 -0.0667066 0.0006128 1.0753533 0.2371039 0.2159576 0.2852541 1.8417029 -0.1893758 0.2471352 -0.2057985 0.3265462 -0.8914447 -0.1850964 -0.1401126 0.0193999 -0.2028683 -0.0086755 -0.2495931 -0.1050745 -0.3271397 1.58754 0.59579 0.3535359 0.4291261 1.1355669 -0.0125893 0.4465836 0.0658316 0.3824029 -0.0742444 0.0062047 0.0289931 -0.0311316 -0.0008001 -0.057487 0.0088992 -0.0494611 0.0058623 -0.0041956 0.0268329 -0.0713891 -0.01675 0.0546214 -0.0811127 -0.0940669 -0.0526825 -0.0534056 0.0504093 0.0225124 -0.0097555 0.0086126 -0.0631321 0.0013416 0.0042208 -0.0315088 0.1032112 -0.0836514 0.0294871 -0.0575612 0.0344535 0.0452918 -0.0097109 -0.0683637 -0.0052308 0.0135626 -0.1025782 0.0075547 0.1309901 0.0390008 -0.0032402 0.0170736 0.1163417 0.0387745 -0.0134336 -0.0756608 0.0328228 -0.1329128 0.0192362 -0.0216077 0.0557448 -0.1361155 0.0705045 -0.0226147 0.2099032 0.0244089 -0.0466416 0.021441 0.1112491 0.0127187 -0.0340672 0.0287535 0.1450938 0.0734205 -0.0168831 -0.0419806 -0.0190445 -0.0697716 0.0552934 -0.0468419 0.0488525 0.1709587 0.3778659 0.0041207 0.0522071 0.0196475 0.1619731 -0.0982273 0.0945555 -0.1442154 0.1543435 0.23752 0.0270275 -0.0655594 0.0642953 0.1872926 0.0617236 -0.0668018 0.0547483 0.3481279 0.2875108 0.0109873 -0.0417419 -0.0243403 0.1571247 0.0354138 -0.025785 0.0493368 0.3579221 unknown
polarizability: 147.8285206|17.364846|136.9166729|13.9232528|-4.306036|75.145616 unknown
InChI: InChI=1S/C8H11N3O4/c9-5-1-2-11(8(13)10-5)6-4-14-7(3-12)15-6/h1-2,6-7,12H,3-4,9H2
charge 0 multiplicity 1
26 atoms
O  1.854245 0.301578 1.240524
O  2.928239 1.416809 -0.508733
O  2.700309 -2.230339 0.165007
O  -1.335583 2.257422 -0.50922
N  -0.351883 0.276619 0.230213
N  -2.612941 0.277227 -0.646552
N  -3.825745 -1.697835 -0.739416
C  0.81719 1.125256 0.633934
C  1.49729 1.830289 -0.583293
C  2.949447 0.176062 0.254256
C  2.784891 -1.032838 -0.681993
C  -0.414325 -1.073602 0.49432
C  -1.48025 1.007923 -0.338965
C  -1.555677 -1.79004 0.179962
C  -2.656437 -1.053793 -0.403571
H  0.463178 1.844132 1.38875
H  1.044926 1.51432 -1.538375
H  1.469482 2.92424 -0.50216
H  3.886057 0.117459 0.829237
H  3.672515 -1.058923 -1.345534
H  1.876105 -0.918011 -1.307564
H  0.475876 -1.524586 0.944056
H  -1.610285 -2.861197 0.38253
H  2.888282 -3.035136 -0.378348
H  -3.95618 -2.693356 -0.583983
H  -4.578225 -1.137381 -1.136682
