program: Gaussian 09
title: 000151167
version: EM64L-G09RevD.01
frameworkgroup: C1[X(C20H23F3N2O2)]
method: RPBEPBE
basis: SDD
operation: Freq
keyword: #p
keyword: freq=noraman
keyword: PBEPBE/SDD
title: #p freq=noraman PBEPBE/SDD
converged: YES YES NO NO
title: Mulliken charges:
elementType: F F F O O N N C C C C C C C C C C C C C C C C C C C C H H H H H H H H H H H H H H H H H H H H H H H
charge: -0.170217 -0.135341 -0.169134 -0.256914 -0.261414 -0.167311 -0.583749 -0.141020 -0.142165 -0.478028 -0.392284 -0.391250 -0.485047 0.355497 0.408884 -0.322196 -0.428390 0.155694 -0.536087 -0.262499 -0.233843 -0.252476 0.367004 -0.329427 -0.368741 -0.545093 0.401402 0.212896 0.213129 0.232511 0.204886 0.180718 0.240961 0.196944 0.210458 0.196577 0.249983 0.285238 0.264342 0.262374 0.255613 0.275985 0.219310 0.223060 0.224620 0.247223 0.258556 0.220227 0.224700 0.263837
chargesum: 0.00000
title: Mulliken charges with hydrogens summed into heavy atoms:
elementType: F F F O O N N C C C C C C C C C C C C C C C C C C C C
charge: -0.170217 -0.135341 -0.169134 -0.256914 -0.261414 -0.167311 -0.034170 0.071876 0.070963 -0.040631 0.029395 0.016152 -0.038487 0.355497 0.408884 -0.059822 -0.172777 0.155694 -0.260102 -0.043189 -0.010783 -0.027856 0.367004 -0.082204 -0.110185 0.163671 0.401402
polarizability: 2.97445803e+02 2.41489394e+01 2.36161237e+02 -1.14143548e+01 2.36964003e+01 1.73175293e+02
1716.lowfreq: -15.3687 -10.1436 -1.8896 -0.0007 -0.0003 0.0004 5.4397 10.4193 24.3679
frequency: -9.0525 9.8055 24.0033 31.8524 48.8927 51.5981 59.9561 76.2349 80.3801 103.2283 121.6558 140.0879 154.3191 168.0457 203.7741 208.1694 233.3390 244.8805 257.0631 261.4548 285.4540 288.7374 309.0860 330.5715 349.3077 355.2311 364.5466 402.6579 413.3081 418.2069 438.0474 453.6250 467.0124 499.2655 509.5558 531.8176 539.5394 543.7285 553.4523 581.9387 610.0007 614.2707 629.6854 641.2021 649.2953 691.0622 710.2670 724.0673 751.9618 757.8966 766.6505 791.5956 797.3186 811.8632 847.6360 861.4697 876.9061 906.3518 915.6975 929.5301 929.9880 930.7951 962.1930 979.4855 981.6824 985.0707 987.6226 990.8022 1000.9292 1017.5003 1027.3385 1057.2001 1069.5224 1075.2918 1086.9396 1107.1516 1110.7041 1111.3713 1123.5399 1135.9314 1139.7962 1150.7679 1151.9957 1161.5384 1167.7421 1176.6102 1182.0097 1199.9187 1211.3994 1235.3325 1241.6057 1246.8405 1265.2305 1276.8451 1281.6043 1288.2921 1302.9373 1331.1909 1333.3660 1345.9383 1359.2658 1371.2969 1378.7545 1386.8204 1392.2821 1419.4401 1435.0345 1436.9461 1458.3007 1460.0612 1468.1737 1471.8051 1474.5344 1476.8430 1487.9649 1489.0749 1588.9274 1598.3485 1608.1605 1609.7683 1631.3323 2830.8645 2849.6661 2872.5858 2961.7684 2979.3313 2984.0025 2997.0353 3032.8843 3044.3797 3046.5252 3051.6683 3062.1290 3111.7769 3122.8786 3129.0422 3137.4140 3152.5478 3154.2901 3161.3256 3161.4793 3181.0490 3441.2338 3569.1475
redmass: 6.7059 10.3307 6.0897 3.9294 7.6457 4.0721 5.2031 4.1578 4.4621 4.2107 4.1935 4.0406 2.4843 3.7346 3.1736 4.0033 4.0714 1.1735 4.1007 3.7747 2.4431 1.6441 3.2125 4.6958 2.9603 3.1709 4.4225 9.8151 2.8946 3.0805 10.1054 3.3379 3.6044 4.4577 4.8142 4.6568 9.1712 4.3898 5.1006 3.4857 5.9262 5.9529 1.6564 3.2038 4.6416 7.7050 1.8372 4.3749 3.0019 2.2846 1.5856 3.8549 2.4315 2.3022 2.6419 1.2527 2.9219 1.4725 2.3235 1.4008 2.6806 1.5902 2.3438 2.4815 1.7782 4.3503 5.3916 4.0530 1.4044 2.0830 2.0250 2.3147 7.3503 1.7800 2.5080 1.8248 1.3243 1.8865 2.1436 2.5601 1.7102 2.6895 2.6078 2.0367 1.0610 1.4779 1.1184 2.5568 1.7983 1.3739 1.3917 3.9736 1.2600 1.3424 1.3122 1.3909 1.4737 1.3524 1.3337 1.4089 1.3749 1.5238 1.8160 3.8442 3.1151 3.2132 1.2946 2.0182 1.1280 1.0911 1.1262 1.0579 1.1957 1.8900 1.1424 1.9741 6.0580 7.9922 5.9623 6.7032 1.0984 1.0728 1.0719 1.0815 1.0327 1.0710 1.0722 1.0630 1.1008 1.0869 1.0888 1.1042 1.1022 1.0851 1.0876 1.0997 1.0933 1.0962 1.0928 1.0887 1.0973 1.0972 1.0448 1.0972
irintensity: 0.4076 0.1456 0.6281 0.0444 0.2519 1.5339 0.2962 0.5573 0.8320 3.4424 1.5777 4.5733 0.9740 0.3097 0.8380 0.9039 3.4323 0.6674 1.7646 1.1485 43.2035 54.5410 12.5364 6.6232 0.3960 5.2016 4.8319 0.3224 1.2071 3.3087 3.3838 0.3844 2.4242 6.8351 2.9964 6.4304 17.8340 4.5968 8.6561 7.7575 3.9804 5.2403 158.7383 15.2915 26.4726 6.4539 56.5509 2.0523 10.5844 41.5419 5.3129 6.6898 36.8655 13.6111 10.2762 0.6178 3.4769 14.4612 7.8350 4.7666 16.5721 0.9642 42.8455 86.0292 18.6631 21.7733 178.4791 0.3075 3.1541 12.0410 11.3948 26.3264 218.0482 21.9091 39.5644 10.7009 15.1852 102.6692 23.5050 6.2964 54.3723 535.3163 188.5668 207.9639 0.1025 11.3564 1.8000 13.3353 2.7828 1.4266 15.9751 41.8557 20.1661 6.3307 14.8385 1.2169 10.7377 4.2801 3.1499 11.4866 1.6039 2.7744 3.5230 11.6798 3.2254 27.3854 2.3957 14.7859 11.9461 0.5473 75.8845 17.7934 15.4417 12.2302 19.6698 87.8072 0.3341 0.0402 2.3332 10.5713 41.3376 68.7864 91.8469 90.9851 59.5962 14.0032 60.9601 59.0849 12.0803 1.4454 37.0906 38.2847 66.0532 5.1353 7.5512 12.5567 28.9433 34.4466 1.7109 2.3499 16.1388 2.9114 2.3684 1.1785
temp: 298.150 k
press: 1.00000 atm
elementType: 9 9 9 8 8 7 7 6 6 6 6 6 6 6 6 6 6 6 6 6 6 6 6 6 6 6 6 1 1 1 1 1 1 1 1 1 1 1 1 1 1 1 1 1 1 1 1 1 1 1
symmnumber: 1
zpe: 1039547.3 jmol-1
zpe.correction: 0.395943 hartree
zpe.thermalcorrener: 0.420671 hartree
zpe.thermalcorrenthalpy: 0.421616 hartree
zpe.thermalcorrgfe: 0.339333 hartree
zpe.sumelectzpe: -1333.349581 hartree
zpe.sumelectthermal: -1333.324852 hartree
zpe.sumelectthermalent: -1333.323908 hartree
zpe.sumelectthermalfe: -1333.406191 hartree
dipole: 3.2992 2.3300 1.3429
dipole: 4.2565
quadrupole: -178.0135 -136.7967 -157.6219
quadrupole: -6.5488 2.0498 6.1519
quadrupole: -20.5362 20.6807 -0.1445 -6.5488 2.0498 6.1519
hfenergy: -1333.7455239 hartree
pointgroup: C01 [X(C20H23F3N2O2)]
dipole: -1.2496743 0.9729212 -0.544135 debye
polarizability: 294.5978201|-27.6425253|237.8790164|-12.5812259|-24.3338543|174.3054967 unknown
InChI: InChI=1S/C20H23F3N2O2/c1-26-18-10-9-16(27-20(21,22)23)12-15(18)13-25-11-5-8-17(24)19(25)14-6-3-2-4-7-14/h2-4,6-7,9-10,12,17,19H,5,8,11,13,24H2,1H3
charge 0 multiplicity 1
50 atoms
F  4.417073 -2.150803 -0.189146
F  6.471061 -1.487383 0.532565
F  5.523994 -0.506713 -1.288731
O  -0.247776 2.32045 -0.104936
O  4.747683 -0.093933 0.881888
N  -0.953369 -0.931699 0.34046
N  -4.342322 -2.651165 0.338565
C  -2.366459 -1.187705 0.767449
C  -2.88588 -2.535033 0.138718
C  -2.386979 -2.671283 -1.322967
C  -0.210499 -2.142104 -0.075107
C  -0.831492 -2.742863 -1.360706
C  -0.242124 -0.089148 1.341124
C  -3.268334 0.00345 0.41647
C  1.040833 0.533156 0.812815
C  -3.042174 0.773256 -0.752436
C  -4.375742 0.327751 1.242279
C  1.015708 1.753767 0.067758
C  2.293359 -0.065348 1.061943
C  -3.914516 1.828855 -1.099202
C  -5.246163 1.388631 0.901604
C  -5.021987 2.140523 -0.275467
C  3.467813 0.516923 0.550813
C  2.211496 2.334497 -0.425643
C  3.454486 1.708909 -0.185816
C  -0.351375 3.593372 -0.822832
C  5.262785 -1.022418 0.012887
H  -2.42354 -1.338004 1.873348
H  -2.431072 -3.356649 0.727892
H  -2.75553 -1.805411 -1.905182
H  -2.833102 -3.576361 -1.778226
H  -0.174635 -2.911094 0.740057
H  0.835522 -1.854718 -0.277534
H  -0.490473 -3.791491 -1.460301
H  -0.451259 -2.191451 -2.239596
H  -0.002843 -0.679219 2.262608
H  -0.938523 0.717208 1.631383
H  -4.883808 -1.917767 -0.13247
H  -4.705447 -3.588196 0.135092
H  -2.152557 0.552891 -1.351149
H  -4.558885 -0.26397 2.146656
H  2.35536 -0.982861 1.656049
H  -3.733505 2.40817 -2.013134
H  -6.09562 1.627315 1.552048
H  -5.698334 2.96075 -0.543115
H  2.18925 3.271221 -0.98872
H  4.387567 2.142826 -0.555692
H  0.015904 3.499162 -1.863144
H  0.204948 4.395523 -0.300225
H  -1.426618 3.822883 -0.825794
