program: Gaussian 09
title: 000151166
version: EM64L-G09RevD.01
frameworkgroup: C1[X(C15H13ClFNO2)]
method: RPBEPBE
basis: SDD
operation: Freq
keyword: #p
keyword: freq=noraman
keyword: PBEPBE/SDD
title: #p freq=noraman PBEPBE/SDD
converged: YES YES NO NO
title: Mulliken charges:
elementType: Cl F O O N C C C C C C C C C C C C C C C H H H H H H H H H H H H H
charge: -0.044375 -0.191307 -0.399566 -0.260299 -0.499009 0.313333 0.254471 -0.565772 0.460581 -0.650509 -0.316140 -0.408751 0.392630 -0.814325 -0.327858 0.229793 0.233076 -0.239817 -0.365089 -0.214149 0.238296 0.265120 0.252197 0.247377 0.367414 0.230849 0.223823 0.224275 0.235387 0.254449 0.254742 0.237895 0.381258
chargesum: 0.00000
title: Mulliken charges with hydrogens summed into heavy atoms:
elementType: Cl F O O N C C C C C C C C C C C C C C C
charge: -0.044375 -0.191307 -0.018308 -0.260299 -0.131594 0.313333 0.254471 -0.327475 0.460581 -0.133192 -0.068763 -0.177902 0.392630 -0.130839 -0.327858 0.229793 0.233076 0.014632 -0.110347 0.023746
polarizability: 2.79888617e+02 2.21004708e-01 1.98715493e+02 -4.15315053e+00 -3.09916268e+00 1.13626976e+02
1716.lowfreq: -21.1921 -3.6113 -1.5141 0.0013 0.0016 0.0019 8.0487 28.9460 36.6609
frequency: -20.9289 28.9390 36.6450 50.7241 59.1870 67.4468 104.6920 115.9708 137.8949 165.8601 209.2300 223.2367 241.9425 264.5743 287.3375 303.1509 342.4832 378.0243 388.4788 422.2827 439.7631 467.0923 486.2741 509.1138 517.5069 541.8798 544.6314 565.4740 570.2072 649.2544 650.8392 691.1770 695.4293 703.9958 723.8413 755.3324 759.2754 788.3201 823.6033 853.9452 857.1096 871.7744 875.5470 902.6187 924.8796 940.7035 944.8939 960.1352 1005.8105 1046.0718 1061.3631 1066.8386 1114.2490 1127.1888 1168.8889 1169.6855 1184.1980 1203.7497 1228.3512 1260.0402 1275.3298 1291.8176 1319.5682 1339.2549 1356.4296 1375.9417 1397.8613 1421.6570 1434.3166 1444.0584 1470.8524 1472.1711 1476.3272 1493.9121 1520.6902 1570.8353 1590.6655 1609.1651 1623.9622 1644.1387 2972.2429 2998.9142 3052.8134 3081.4677 3104.6280 3116.4532 3123.9843 3153.4531 3156.0316 3170.7489 3185.4523 3329.4824 3501.5048
redmass: 1.0111 8.9962 6.8998 6.3849 6.0147 6.1168 8.8315 5.8286 6.4761 6.4301 4.7862 4.7080 5.7344 4.0933 7.3319 5.8249 5.1065 7.9843 3.5153 3.3134 3.5597 4.1197 6.8048 2.8007 5.2514 4.0082 4.0406 6.1164 3.5508 1.8944 3.6877 3.1176 3.6836 2.0141 2.6087 2.0459 1.9082 4.6943 1.5308 3.8705 3.3072 4.4862 1.3630 1.7275 2.8494 1.3045 2.0636 1.3816 1.5802 1.5385 1.8878 2.0173 2.5033 2.7429 1.4213 1.4324 1.2085 2.0840 1.8507 3.0620 1.3601 1.5810 2.7449 2.5131 3.1615 6.5902 1.2233 3.6295 2.8114 1.1119 1.5259 1.1155 1.6707 2.3669 2.6589 5.2734 4.4966 8.6284 6.6486 5.7705 1.0387 1.0646 1.0951 1.0996 1.0968 1.0913 1.0885 1.0959 1.0866 1.0927 1.1001 1.0790 1.0638
irintensity: 0.5136 0.2094 2.0353 1.4710 0.2766 0.2409 1.8707 1.3027 2.1718 1.0806 0.8690 2.5392 1.9279 0.3071 6.6013 2.4699 2.7612 6.5575 8.5303 3.0130 9.7209 6.2546 4.9971 12.5673 0.1462 37.1603 13.2292 10.4916 24.6953 95.0993 7.5763 47.2120 44.2785 49.9742 62.4509 12.2599 79.8626 25.8058 11.0397 25.1302 4.9120 76.2870 0.3334 1.5009 13.1723 1.2044 5.0077 1.3558 10.0277 18.7283 47.0884 229.8645 83.5394 0.5071 6.7142 1.5228 15.5352 22.9537 0.8256 1.6681 4.2818 5.7161 62.7212 101.5917 66.8409 5.3974 5.5888 1.5244 21.7629 29.1556 34.3302 15.4220 131.9949 17.9575 452.5430 32.9632 107.6354 89.5205 15.9891 129.6166 51.4946 12.3225 23.1034 17.3168 2.9717 20.2981 19.2788 11.6949 0.7929 2.9281 8.0176 263.9591 30.2911
temp: 298.150 k
press: 1.00000 atm
elementType: 17 9 8 8 7 6 6 6 6 6 6 6 6 6 6 6 6 6 6 6 1 1 1 1 1 1 1 1 1 1 1 1 1
symmnumber: 1
zpe: 643323.5 jmol-1
zpe.correction: 0.245029 hartree
zpe.thermalcorrener: 0.262828 hartree
zpe.thermalcorrenthalpy: 0.263772 hartree
zpe.thermalcorrgfe: 0.197679 hartree
zpe.sumelectzpe: -1343.090378 hartree
zpe.sumelectthermal: -1343.072578 hartree
zpe.sumelectthermalent: -1343.071634 hartree
zpe.sumelectthermalfe: -1343.137727 hartree
dipole: -1.0009 -0.0916 0.2414
dipole: 1.0337
quadrupole: -103.5644 -113.2066 -124.6014
quadrupole: -8.1525 1.1549 4.0486
quadrupole: 10.2264 0.5842 -10.8106 -8.1525 1.1549 4.0486
hfenergy: -1343.3354066 hartree
pointgroup: C01 [X(C15H13Cl1F1N1O2)]
dipole: -0.3817708 0.0708569 -0.1208756 debye
polarizability: 277.977168|-7.9164078|198.838015|13.3325193|-9.5088194|115.4159029 unknown
InChI: InChI=1S/C15H13ClFNO2/c1-9-5-6-13(10(7-9)8-14(19)20)18-15-11(16)3-2-4-12(15)17/h2-7,18-19H,8H2,1H3
charge 0 multiplicity 1
33 atoms
Cl 2.372571 -2.447367 1.474164
F  1.417503 1.799976 -1.421463
O  -3.161259 -3.335948 -0.506942
O  -1.01747 -2.995745 0.299683
N  0.516688 -0.547106 -0.048756
C  -1.862329 -0.105499 -0.516916
C  -0.619168 0.312302 0.045361
C  -3.005758 0.709133 -0.35169
C  -2.956972 1.950832 0.327099
C  -1.962008 -1.396521 -1.329362
C  -0.559663 1.554648 0.726954
C  -1.706898 2.358697 0.859035
C  1.854409 -0.137281 -0.016957
C  -4.190406 2.828286 0.4513
C  2.871076 -0.912914 0.618027
C  2.340037 1.023034 -0.690545
C  -1.964658 -2.627527 -0.440526
C  4.231377 -0.560265 0.615659
C  3.681026 1.425575 -0.695564
C  4.640784 0.626218 -0.034198
H  -3.957567 0.370907 -0.781193
H  -1.079012 -1.475682 -1.993325
H  -2.87247 -1.395914 -1.946795
H  0.385873 1.877703 1.174457
H  0.331086 -1.542264 0.161827
H  -1.63388 3.311938 1.396538
H  -5.116475 2.227086 0.479122
H  -4.157064 3.44325 1.368173
H  -4.275952 3.524171 -0.406297
H  4.955972 -1.200491 1.126057
H  3.959262 2.335419 -1.235062
H  5.694804 0.917353 -0.03198
H  -3.12216 -4.117904 0.109814
