program: Gaussian 09
title: 000151158
version: EM64L-G09RevD.01
frameworkgroup: C1[X(C26H26Cl2N3O)]
method: RPBEPBE
basis: SDD
operation: Freq
keyword: #p
keyword: freq=noraman
keyword: PBEPBE/SDD
title: #p freq=noraman PBEPBE/SDD
converged: YES YES NO NO
title: Mulliken charges:
elementType: Cl Cl O N N N C C C C C C C C C C C C C C C C C C C C C C C C C C H H H H H H H H H H H H H H H H H H H H H H H H H H
charge: -0.039510 -0.036311 -0.284328 -0.168766 -0.147062 -0.479091 0.233593 0.249278 0.348335 0.456585 -0.394155 -0.393305 -0.300390 -0.207704 -0.326751 -0.306280 0.433616 -0.333865 -0.346420 -0.623210 -0.584536 -0.587279 0.328054 -0.260149 -0.221678 -0.411870 -0.389638 0.332844 -0.398193 -0.365473 -0.348219 -0.339301 0.246881 0.257464 0.252580 0.257763 0.289858 0.264728 0.328694 0.215665 0.270204 0.246988 0.245443 0.269142 0.248298 0.268920 0.287627 0.275171 0.284938 0.271840 0.262242 0.262119 0.261342 0.261391 0.254519 0.267357 0.277254 0.282751
chargesum: 1.00000
title: Mulliken charges with hydrogens summed into heavy atoms:
elementType: Cl Cl O N N N C C C C C C C C C C C C C C C C C C C C C C C C C C
charge: -0.039510 -0.036311 -0.284328 -0.168766 -0.147062 -0.150397 0.233593 0.249278 0.348335 0.456585 0.110191 0.117038 -0.010531 0.057024 -0.111086 -0.036076 0.433616 -0.086877 -0.100977 0.163150 -0.021737 -0.030501 0.328054 0.002094 0.040440 -0.150528 -0.128248 0.332844 -0.143674 -0.098116 -0.070965 -0.056550
polarizability: 8.56295158e+02 1.11175806e+01 3.02946150e+02 6.63871588e+01 -1.41482140e+01 2.67311349e+02
1716.lowfreq: -12.3801 -5.7802 -3.3112 -0.0016 -0.0011 0.0006 2.4726 11.6687 13.7919
frequency: -2.9874 11.4542 13.5787 26.8054 31.2614 36.3937 39.3240 54.8036 58.1366 67.1170 91.7088 109.9085 118.1880 125.3566 136.4498 143.5471 177.9256 193.4095 206.2157 212.9790 224.4831 240.3503 245.1058 260.0593 297.8177 306.5695 315.3913 328.7670 360.4413 382.4161 387.4688 409.5544 414.5200 416.8228 429.1031 461.8192 478.8483 485.7603 501.3315 507.5413 511.3561 535.0425 537.6949 541.3641 573.7618 612.5797 616.2998 625.0026 634.5178 660.7732 670.0551 691.8367 699.2457 707.7366 710.0511 720.2794 759.0618 761.4615 772.6201 782.8819 785.6957 792.0920 800.1955 803.5426 813.7371 816.6341 828.5998 835.9326 844.5327 857.7208 864.9394 933.1014 943.7657 950.2682 952.1339 958.8668 960.3192 970.7999 991.0748 992.6416 999.7566 999.7891 1004.8383 1034.1154 1035.1322 1042.0772 1046.3661 1062.5288 1110.0329 1117.3201 1117.7691 1118.9430 1129.0985 1150.5418 1167.1884 1172.2315 1182.3429 1194.8366 1200.6227 1205.7327 1218.9145 1221.1043 1242.0996 1243.6905 1257.9789 1259.6028 1277.0571 1286.9931 1291.4208 1295.9257 1309.7861 1330.9423 1352.1592 1354.8721 1360.0065 1367.0999 1376.0507 1389.9604 1400.4232 1405.1798 1429.7341 1432.6960 1439.4617 1454.0037 1461.4967 1462.1648 1465.6998 1475.9196 1484.8414 1486.3277 1496.3549 1500.8181 1508.9366 1525.3079 1553.3609 1562.1136 1574.4144 1584.2217 1614.7117 1619.5940 1623.3037 1630.3625 3009.3115 3014.9385 3020.6789 3061.4611 3064.2518 3071.1201 3077.7171 3102.6343 3135.2339 3137.3605 3140.5624 3143.9854 3144.5646 3145.7699 3147.0442 3157.4313 3161.0500 3170.2580 3175.0235 3178.0454 3178.5780 3180.0933 3185.9121 3191.1030 3209.2071 3518.8710
redmass: 9.0889 5.1743 7.8313 13.2419 7.9609 6.3117 5.8119 4.9805 4.8464 3.8060 3.4044 3.0937 3.1147 2.9991 5.4214 4.4154 6.3087 4.5936 6.8248 4.6785 1.1393 7.0828 3.2564 4.8230 4.7442 3.4383 4.1263 4.2734 3.6069 5.0042 5.0565 3.0983 3.0918 3.0240 3.1378 4.4210 4.2021 4.2676 3.3406 2.8016 4.3078 5.2349 4.4356 2.5322 4.1871 5.3389 2.0017 5.3597 6.7751 3.2140 6.4829 4.5729 4.4840 5.1502 4.3916 4.2548 2.0623 4.3533 2.1219 1.1228 4.6339 1.2133 1.2832 3.4809 1.6370 1.7614 2.6827 1.4105 1.8676 4.0788 1.6842 1.3242 1.5142 1.8640 1.5540 1.3676 1.3343 1.3225 3.0548 3.1113 2.0475 1.6972 1.3612 4.5537 2.1851 2.0131 2.8365 3.3212 1.6871 1.5392 1.3284 1.3738 1.2576 2.0970 1.5211 1.2655 1.5540 1.2100 1.3108 1.3975 2.0970 2.3545 3.7663 2.6049 1.1625 1.1643 1.3402 1.9355 1.1836 1.3347 1.3672 2.3364 1.3037 1.3845 1.6283 5.2029 3.9858 1.8391 3.1682 4.9322 3.8113 4.0178 1.4511 1.7315 1.0962 1.0961 2.2222 1.0416 1.0886 2.5342 1.1328 1.5095 1.6315 3.1869 4.1697 4.6234 6.3248 5.3723 6.2139 5.7455 6.1319 6.3633 1.0348 1.0606 1.0613 1.0568 1.0569 1.1041 1.1037 1.1034 1.1014 1.0888 1.0908 1.1107 1.0907 1.0904 1.1107 1.0880 1.0896 1.0948 1.0949 1.0963 1.0951 1.0959 1.0911 1.0985 1.0969 1.0753
irintensity: 0.1851 0.3377 0.7087 1.7579 0.2416 0.3304 0.3939 1.1539 0.6693 0.5892 2.3760 3.1299 0.6278 1.4292 0.8765 1.9082 2.3704 4.8986 2.9016 1.5714 0.6189 7.0859 6.8796 4.7494 0.4887 4.5565 0.1046 3.3137 6.9676 2.3026 24.1186 2.1469 17.4678 6.7532 1.7494 6.9660 4.3883 0.1785 24.2467 16.6368 9.8520 17.3766 6.0865 14.9591 7.4407 4.2561 26.5483 1.4861 2.4012 23.4391 63.9916 29.0555 7.3841 66.3433 22.6929 3.2267 49.2010 6.1351 53.5906 4.2791 3.5049 9.1867 17.9878 7.3714 7.4000 81.0753 20.9034 35.4715 47.8622 27.9943 0.6862 1.4181 13.6612 22.9250 9.2378 0.5737 0.9984 0.2963 17.5685 6.2091 3.4193 2.5211 0.1497 0.4397 0.5282 0.5503 3.2543 5.3197 57.6599 18.7286 0.3674 15.7458 26.5697 14.9749 10.0158 193.5622 105.6333 7.4220 14.4002 71.3253 36.8491 79.2580 473.8416 17.2062 12.4369 12.2934 30.9171 15.8877 8.2905 3.0746 4.4007 6.9811 32.3447 75.4251 2.6344 16.1844 52.1853 34.0448 67.1985 31.7626 8.5368 1.6035 2.1989 7.6666 17.2122 9.7109 21.7965 21.2471 34.2454 396.1273 9.3387 97.7081 230.2467 6.6009 69.1647 20.9479 2.2786 50.0769 23.7648 12.2042 381.0293 674.3303 40.1789 18.6062 28.5496 16.6280 16.3842 7.0431 7.3477 6.5869 4.6028 3.8019 3.7197 7.7508 24.5153 3.5843 9.8915 11.0818 0.8086 11.8093 1.6258 12.0682 4.7976 0.7607 1.9765 3.9329 0.3611 58.8824
temp: 298.150 k
press: 1.00000 atm
elementType: 17 17 8 7 7 7 6 6 6 6 6 6 6 6 6 6 6 6 6 6 6 6 6 6 6 6 6 6 6 6 6 6 1 1 1 1 1 1 1 1 1 1 1 1 1 1 1 1 1 1 1 1 1 1 1 1 1 1
symmnumber: 1
zpe: 1217616.2 jmol-1
zpe.correction: 0.463766 hartree
zpe.thermalcorrener: 0.492488 hartree
zpe.thermalcorrenthalpy: 0.493432 hartree
zpe.thermalcorrgfe: 0.399863 hartree
zpe.sumelectzpe: -2163.478002 hartree
zpe.sumelectthermal: -2163.449280 hartree
zpe.sumelectthermalent: -2163.448335 hartree
zpe.sumelectthermalfe: -2163.541904 hartree
dipole: -23.8558 2.2535 -2.2605
dipole: 24.0684
quadrupole: 8.5848 -181.6101 -190.8059
quadrupole: -15.3442 28.2555 -17.0350
quadrupole: 129.8618 -60.3330 -69.5289 -15.3442 28.2555 -17.0350
hfenergy: -2163.9417673 hartree
pointgroup: C01 [X(C26H26Cl2N3O1)]
dipole: -9.432965 0.2224576 0.7977162 debye
polarizability: 860.7717122|-41.8843696|257.9888221|10.0418238|1.1701844|307.7921235 unknown
InChI: InChI=1S/C26H26Cl2N3O/c1-30-17-14-25(24-4-2-3-5-26(24)30)29-20-6-10-22(11-7-20)32-23-12-8-21(9-13-23)31(18-15-27)19-16-28/h2-14,17,29H,15-16,18-19H2,1H3
charge 1 multiplicity 1
58 atoms
Cl 7.655831 3.814751 -2.117695
Cl 8.217643 -0.352341 3.983945
O  1.806485 -2.158959 -1.155228
N  6.403114 0.791961 0.432327
N  -6.144195 0.536103 2.061788
N  -3.616871 -0.563285 -1.140829
C  -5.761389 0.355066 -0.368193
C  -6.619121 0.690776 0.740717
C  -4.418864 -0.16571 -0.106939
C  5.244766 0.085661 0.05583
C  6.690273 2.136576 -0.10049
C  7.383274 0.214882 1.372046
C  -4.000942 -0.267188 1.253162
C  -4.870773 0.071834 2.281619
C  -6.263217 0.558142 -1.689297
C  -7.934528 1.179687 0.501405
C  -2.229007 -0.943699 -1.082168
C  4.937396 -1.193989 0.61913
C  4.333739 0.615412 -0.914226
C  -7.014475 0.871966 3.217359
C  7.397109 2.06242 -1.468283
C  6.965375 0.46364 2.834486
C  2.902673 -1.346137 -0.710573
C  -7.558312 1.038887 -1.914087
C  -8.399407 1.343546 -0.809955
C  3.782667 -1.90145 0.236244
C  3.179638 -0.093537 -1.295419
C  0.496813 -1.682401 -1.109972
C  -1.811196 -2.095593 -1.798744
C  -1.272273 -0.156849 -0.393117
C  -0.456604 -2.462585 -1.815066
C  0.086571 -0.523991 -0.39882
H  5.76375 2.731477 -0.188146
H  7.34041 2.674558 0.611328
H  7.511571 -0.867357 1.193419
H  8.369114 0.67874 1.194557
H  -3.017144 -0.660535 1.508599
H  -4.569667 -0.038107 3.325542
H  -4.047005 -0.637162 -2.066255
H  -5.629756 0.366109 -2.562155
H  -8.592475 1.43316 1.335048
H  5.597182 -1.652577 1.359996
H  4.528243 1.575094 -1.40002
H  -7.925726 0.250754 3.209251
H  -6.465421 0.673974 4.149103
H  -7.294718 1.938472 3.195715
H  6.796929 1.542217 -2.228597
H  8.398621 1.612807 -1.398584
H  5.992109 0.013065 3.076802
H  6.96778 1.533109 3.092525
H  -7.918432 1.190285 -2.935536
H  -9.412571 1.719246 -0.981726
H  3.566442 -2.885257 0.663215
H  2.519274 0.318872 -2.065708
H  -2.54616 -2.710443 -2.330493
H  -1.576432 0.761721 0.119659
H  -0.113887 -3.348589 -2.356264
H  0.821571 0.086173 0.13267
