program: Gaussian 09
title: 000151152
version: EM64L-G09RevD.01
frameworkgroup: C1[X(C4H8O5)]
method: RPBEPBE
basis: SDD
operation: Freq
keyword: #p
keyword: freq=noraman
keyword: PBEPBE/SDD
title: #p freq=noraman PBEPBE/SDD
converged: YES YES NO NO
title: Mulliken charges:
elementType: O O O O O C C C C H H H H H H H H
charge: -0.465871 -0.425237 -0.424792 -0.427374 -0.210096 -0.107991 -0.126361 -0.368586 0.161709 0.225335 0.278634 0.187230 0.263801 0.349702 0.366585 0.338147 0.385165
chargesum: 0.00000
title: Mulliken charges with hydrogens summed into heavy atoms:
elementType: O O O O O C C C C
charge: -0.116169 -0.058652 -0.086645 -0.042210 -0.210096 0.117344 0.152273 0.082445 0.161709
polarizability: 6.78035218e+01 -2.57461987e+00 6.25901202e+01 3.20507187e-01 1.24760185e+00 5.02697472e+01
1716.lowfreq: -9.6028 -1.4196 0.0012 0.0012 0.0013 6.4878 50.0312 68.8746 114.7615
frequency: 50.0240 68.8723 114.7518 156.7047 191.1321 222.0186 231.9928 251.2244 320.7194 376.3548 388.9608 417.5070 469.3820 547.5732 594.1718 639.3124 701.9166 816.5279 904.3373 957.8167 977.1019 998.6128 1036.2138 1057.7986 1071.6353 1156.3044 1167.0231 1234.6124 1279.9621 1299.9487 1305.6706 1342.2670 1364.3197 1374.1250 1390.7762 1459.3512 1677.5013 2942.1920 2969.5841 3070.1759 3105.1742 3518.1419 3544.2628 3557.8586 3583.7010
redmass: 6.0551 8.8985 4.5991 3.6682 3.3598 1.1221 2.5227 4.0112 1.1577 1.9733 3.3089 4.8175 5.1234 1.9831 3.6613 1.9679 3.7873 3.9508 3.7709 2.4336 3.3556 4.3377 2.7766 2.4230 2.0861 1.2599 1.1775 1.3466 1.2777 1.8050 1.3776 1.2457 1.5750 1.2440 1.2459 1.0748 9.4291 1.0705 1.0838 1.0846 1.0938 1.0642 1.0649 1.0664 1.0666
irintensity: 2.8656 2.3280 1.4191 8.7371 17.8333 118.0741 38.7520 8.3195 97.3947 263.0952 5.4338 13.6950 2.6739 70.1777 19.6325 143.5486 3.7781 26.0479 12.1395 74.1134 96.8256 58.8842 258.6022 12.3636 20.9964 45.4241 15.1781 2.5780 29.8763 56.4225 12.8728 16.9624 10.1032 5.7430 19.4126 6.9992 231.5570 80.4280 38.6198 8.2176 6.5018 22.8517 22.1949 7.2310 7.9107
temp: 298.150 k
press: 1.00000 atm
elementType: 8 8 8 8 8 6 6 6 6 1 1 1 1 1 1 1 1
symmnumber: 1
zpe: 334389.8 jmol-1
zpe.correction: 0.127362 hartree
zpe.thermalcorrener: 0.137925 hartree
zpe.thermalcorrenthalpy: 0.138869 hartree
zpe.thermalcorrgfe: 0.091191 hartree
zpe.sumelectzpe: -532.582198 hartree
zpe.sumelectthermal: -532.571636 hartree
zpe.sumelectthermalent: -532.570691 hartree
zpe.sumelectthermalfe: -532.618369 hartree
dipole: -1.6834 2.1620 4.2372
dipole: 5.0459
quadrupole: -54.1330 -48.9164 -53.4408
quadrupole: 6.1364 -6.2609 -0.0363
quadrupole: -1.9696 3.2470 -1.2774 6.1364 -6.2609 -0.0363
hfenergy: -532.7095601 hartree
pointgroup: C01 [X(C4H8O5)]
dipole: -0.6119178 -1.0988321 -1.5359838 debye
dipolederiv: -0.4332341 0.0294044 0.2335839 0.077843 -0.5825896 0.1779887 0.2036556 0.19968 -0.6354577 -0.5578176 0.0320506 -0.1785449 0.0424576 -0.6545805 -0.205132 -0.188471 -0.1568187 -0.3141939 -0.75295 -0.1350504 0.0636702 -0.1487688 -0.457518 0.319317 0.0829852 0.2823657 -0.3486419 -0.3380317 0.2069799 -0.0180108 0.1528694 -1.2038451 -0.1131377 -0.0058664 -0.1678293 -0.4264805 -0.8625512 -0.3114719 -0.0186614 -0.0988123 -0.7409808 -0.0743736 0.1162146 -0.0018021 -0.2947638 0.2080452 -0.0369971 -0.0537757 0.0845468 0.3719049 -0.1668885 0.0173002 -0.2031636 0.4260418 -0.0400228 0.0484715 0.0429142 -0.1163983 0.5201251 0.1349684 0.1146812 0.12099 0.2462764 0.3497404 0.1139018 0.015768 0.1097584 0.3890669 -0.1623792 -0.0984329 -0.1606037 0.3200402 1.1661111 0.1302554 -0.0511657 -0.0069923 1.4513803 0.1506573 -0.2443684 0.1533195 0.2220428 0.0348485 -0.0213976 0.0085372 -0.0037827 -0.181333 -0.0301993 0.0178562 -0.0726673 -0.0223155 0.1394004 -0.0140459 0.0350673 0.0253861 0.0013718 0.0347182 0.0114088 0.0514342 0.0459698 -0.0926757 -0.0070743 -0.0935484 -0.0168803 0.0340273 0.0416181 -0.1240746 0.0969022 -0.1810864 0.1222668 -0.004431 0.0160961 0.0365761 -0.0371096 -0.0235754 0.054743 -0.0490937 0.0516867 0.1761173 -0.0363092 -0.2142783 -0.0822025 0.31387 -0.0169772 -0.1644513 -0.00734 0.2293502 0.3640219 -0.0565846 0.1101301 -0.0149562 0.3223499 0.0673026 0.1274414 0.0897409 0.1711907 0.4144298 0.0621361 0.0339165 0.0187575 0.1286511 -0.1245186 0.0111796 -0.1629837 0.1366573 0.1023017 0.0001622 0.0683018 -0.0594016 0.3252092 -0.0093889 0.0681989 -0.0121304 0.3736838 unknown
polarizability: 67.6864824|2.6385707|62.8228705|-0.4200792|-0.5415916|50.1540363 unknown
InChI: InChI=1S/C4H8O5/c5-1-2(6)3(7)4(8)9/h2-3,5-8H,1H2
charge 0 multiplicity 1
17 atoms
O  -0.352503 0.836516 -1.52811
O  0.106997 1.384751 1.169234
O  -2.678961 -1.058312 0.77836
O  1.736103 -1.689628 -0.014265
O  2.574155 0.476049 0.163091
C  -0.774241 -0.175803 -0.545298
C  0.183083 0.033657 0.656028
C  -2.243579 0.020489 -0.117011
C  1.619765 -0.318547 0.256438
H  -0.632695 -1.201781 -0.949173
H  -0.146246 -0.630419 1.473259
H  -2.895287 0.087084 -1.01713
H  -2.340532 0.946361 0.470842
H  -0.975528 0.852152 -2.296186
H  0.500771 1.98901 0.486539
H  -2.715706 -1.911428 0.27567
H  2.672204 -1.89695 -0.281288
