program: Gaussian 09
title: 000151149
version: EM64L-G09RevD.01
frameworkgroup: C1[X(C6H12O9S)]
method: RPBEPBE
basis: SDD
operation: Freq
keyword: #p
keyword: freq=noraman
keyword: PBEPBE/SDD
title: #p freq=noraman PBEPBE/SDD
converged: YES YES NO NO
title: Mulliken charges:
elementType: S O O O O O O O O O C C C C C C H H H H H H H H H H H H
charge: 1.189834 -0.451973 -0.469938 -0.577054 -0.375287 -0.541893 -0.210956 -0.549640 -0.471072 -0.504514 -0.166309 -0.105389 -0.064914 -0.079184 -0.327985 -0.073951 0.252552 0.253786 0.226338 0.272163 0.253604 0.252682 0.359123 0.376379 0.431604 0.262132 0.402685 0.437175
chargesum: 0.00000
title: Mulliken charges with hydrogens summed into heavy atoms:
elementType: S O O O O O O O O O C C C C C C
charge: 1.189834 -0.092850 -0.093559 -0.145450 -0.375287 -0.139208 -0.210956 -0.112464 -0.471072 -0.504514 0.086243 0.148397 0.161425 0.192979 0.178301 0.188181
polarizability: 1.53980716e+02 5.45017771e+00 1.14074930e+02 -6.18628796e+00 3.28445138e+00 9.91878667e+01
1716.lowfreq: -18.9715 -8.9917 -3.3265 -0.0011 -0.0007 0.0012 20.1388 26.7265 41.7453
frequency: 18.1316 26.3398 41.3580 75.4768 87.6098 94.5274 124.9802 171.0945 176.9951 202.7262 229.2890 245.2048 266.2626 295.7058 306.2531 325.2481 332.4965 333.7297 347.0832 368.5697 398.0000 412.4100 446.6401 472.9069 496.0493 508.4644 578.2560 599.7917 614.9923 624.4028 634.5977 688.7253 799.5912 850.5105 862.2224 883.3516 920.3971 944.8304 966.9758 976.5187 997.4226 1005.5902 1011.8507 1048.3105 1065.3384 1075.4032 1089.3706 1092.0387 1172.4405 1206.7476 1224.5161 1241.8124 1267.6149 1292.8060 1303.2264 1314.5491 1323.4650 1341.8621 1345.2557 1351.7957 1376.4224 1398.4776 1401.6433 1428.9372 1509.9022 1603.9161 2382.7837 2836.0125 2972.5089 2979.4403 2981.0015 2995.5015 3033.2781 3055.1165 3057.5722 3332.6182 3414.4895 3534.7911
redmass: 9.8309 5.9990 6.6386 7.5505 6.6275 8.2951 7.3012 8.0156 12.6523 4.3564 7.5637 8.3621 3.8237 8.9031 3.2214 6.5946 6.7113 1.4272 9.8912 3.8275 3.9166 4.8333 5.3284 5.4198 6.8869 3.3404 3.9132 1.2726 1.5726 1.9427 5.0770 4.0159 3.8791 2.8688 11.6267 2.8434 1.2380 4.6111 2.7596 1.9015 4.4553 4.2652 3.0600 2.1408 3.2330 3.2406 2.2469 4.5092 1.2941 1.1797 1.1895 1.1794 1.1650 1.2479 1.2203 1.2031 1.1870 1.3984 1.2024 1.1716 1.4469 1.1327 1.3909 1.0802 1.1047 8.2065 1.0761 1.0743 1.0744 1.0819 1.0716 1.0845 1.0863 1.1030 1.0925 1.0642 1.0642 1.0662
irintensity: 0.7322 1.1847 1.9296 4.2687 0.7385 3.4307 15.3635 2.0848 0.6337 30.8934 20.5851 5.7365 4.7042 9.2149 25.6430 27.6705 36.4703 22.1310 20.8057 6.1880 17.6287 19.4906 28.4043 36.0061 66.7062 16.1729 89.6816 114.4506 28.9167 141.9059 31.0604 5.6664 44.7509 28.4968 122.7453 73.3053 91.0405 67.6891 74.2459 23.8897 93.6618 46.2104 66.4609 9.7917 1.2896 48.8486 6.8701 80.0534 39.2276 15.3458 15.4203 58.3850 74.7370 101.3324 5.3059 16.3336 18.6320 24.5497 8.5063 24.7263 18.2483 114.4246 71.4097 36.0302 168.3286 94.6051 1861.3034 1062.3110 26.5183 37.9251 6.1436 6.7302 30.3382 2.3188 14.8696 93.6167 76.2332 14.0440
temp: 298.150 k
press: 1.00000 atm
elementType: 16 8 8 8 8 8 8 8 8 8 6 6 6 6 6 6 1 1 1 1 1 1 1 1 1 1 1 1
symmnumber: 1
zpe: 519266.3 jmol-1
zpe.correction: 0.197778 hartree
zpe.thermalcorrener: 0.215486 hartree
zpe.thermalcorrenthalpy: 0.216430 hartree
zpe.thermalcorrgfe: 0.150502 hartree
zpe.sumelectzpe: -1309.381310 hartree
zpe.sumelectthermal: -1309.363603 hartree
zpe.sumelectthermalent: -1309.362659 hartree
zpe.sumelectthermalfe: -1309.428587 hartree
dipole: 8.6534 2.4943 0.7512
dipole: 9.0370
quadrupole: -130.5060 -99.3389 -107.8708
quadrupole: -1.1676 5.6648 -1.7779
quadrupole: -17.9341 13.2330 4.7012 -1.1676 5.6648 -1.7779
hfenergy: -1309.5790884 hartree
pointgroup: C01 [X(C6H12O9S1)]
dipole: 3.2174574 0.2579121 -1.4907737 debye
polarizability: 152.1026495|-5.6544402|98.3420148|-10.1357087|-0.7610732|116.7988481 unknown
InChI: InChI=1S/C6H12O9S/c7-1-3(8)5(10)6(11)4(9)2-15-16(12,13)14/h1,3-6,8-12H,2H2
charge 0 multiplicity 1
28 atoms
S  -3.478001 0.000223 1.056472
O  1.135781 -0.766086 -2.377946
O  3.257018 0.605814 -1.678872
O  -0.529084 1.137014 0.397953
O  -2.759593 -0.655155 -0.581449
O  1.655619 0.900752 1.64116
O  3.525329 -0.896948 1.948571
O  -2.931831 1.676505 0.995077
O  -5.057294 -0.034019 0.859892
O  -2.73281 -0.806613 2.240103
C  1.035793 -0.257939 -0.988039
C  2.108927 0.871663 -0.812442
C  -0.427355 0.18589 -0.714408
C  2.706644 0.945141 0.624277
C  -1.344329 -1.032546 -0.477292
C  3.692987 -0.192645 0.919123
H  1.309501 -1.133222 -0.369944
H  1.656549 1.851073 -1.070948
H  -0.801059 0.737758 -1.603344
H  3.266998 1.898326 0.713255
H  -1.133721 -1.500634 0.506446
H  -1.204103 -1.787012 -1.274565
H  0.520537 -0.256179 -2.967565
H  2.909994 0.053831 -2.437272
H  0.262456 1.05996 1.054619
H  4.534711 -0.331304 0.216456
H  1.932238 0.222771 2.328973
H  -1.888505 1.604682 0.774207
