program: Gaussian 09
title: 000151147
version: EM64L-G09RevD.01
frameworkgroup: C1[X(C8H17NO6S)]
method: RPBEPBE
basis: SDD
operation: Freq
keyword: #p
keyword: freq=noraman
keyword: PBEPBE/SDD
title: #p freq=noraman PBEPBE/SDD
converged: YES YES NO NO
title: Mulliken charges:
elementType: S O O O O O O N C C C C C C C C H H H H H H H H H H H H H H H H H
charge: -0.025441 -0.485084 -0.474453 -0.493004 -0.480878 -0.440764 -0.295288 -0.315438 -0.142665 -0.059341 -0.195604 -0.208672 -0.317373 0.215846 -0.344297 -0.691738 0.264870 0.208946 0.281858 0.237938 0.207636 0.215521 0.369513 0.373424 0.316819 0.363513 0.380597 0.234188 0.269378 0.352226 0.270362 0.307762 0.099644
chargesum: 0.00000
title: Mulliken charges with hydrogens summed into heavy atoms:
elementType: S O O O O O O N C C C C C C C C
charge: 0.074204 -0.115570 -0.101029 -0.129492 -0.100281 -0.088539 -0.295288 0.001381 0.122204 0.149605 0.086254 0.029266 0.105784 0.215846 0.159269 -0.113614
polarizability: 1.52602778e+02 -2.30330093e+00 1.32291657e+02 -5.57891857e+00 5.45759585e+00 1.05481417e+02
1716.lowfreq: -1.1653 -0.0020 -0.0018 0.0006 6.9886 11.1652 22.4524 28.0791 40.3504
frequency: 21.7543 28.0082 40.2845 55.9980 76.3314 79.9824 98.7132 110.5099 121.1207 153.5281 189.4410 215.5742 237.0899 250.9929 267.5023 281.3700 298.2810 315.3255 321.6126 359.7688 378.7360 415.1841 455.2176 484.7614 491.5833 503.4679 512.1234 517.0931 545.6021 582.7313 604.0629 649.8541 681.0788 711.2730 765.1379 786.2739 815.5904 829.5747 866.6329 891.5904 936.0105 969.5609 987.8353 1001.9250 1024.6331 1035.5700 1050.6879 1062.3834 1074.9674 1094.1022 1108.3512 1146.8025 1191.3161 1197.9513 1209.7377 1220.1312 1233.0299 1247.2491 1255.7497 1268.2067 1300.0895 1302.1171 1316.4054 1328.4322 1333.9569 1356.1004 1362.1063 1366.8970 1386.2191 1392.9542 1401.8853 1433.2940 1466.6185 1467.2905 1507.4366 1627.1530 2426.1081 2930.0967 2967.3414 2980.8985 2993.9994 3001.1007 3031.4089 3044.9142 3070.6110 3074.9749 3127.9850 3324.4795 3486.0464 3510.0048 3525.0365 3529.3872 3588.5434
redmass: 6.9262 8.5282 4.8701 5.7950 5.4966 4.3423 3.3683 7.1536 3.5237 5.6936 5.7785 3.9422 4.5914 2.3091 1.7289 3.2672 3.2947 2.5636 1.5217 4.3673 4.6304 3.7122 2.9197 1.2623 1.2551 2.0501 1.1370 2.3839 1.4384 4.6850 3.9299 2.1319 1.8773 3.4294 1.5758 2.8539 3.1083 2.8021 2.1318 2.9451 2.8855 3.3510 2.3019 4.3587 4.1100 2.1524 2.5313 2.6976 2.0044 2.9279 2.8922 1.1636 1.1864 1.1843 1.2961 1.2949 1.2406 1.2621 1.8509 1.3667 1.1940 1.1813 1.2211 1.1997 1.2063 1.3093 1.4344 1.3042 1.3657 1.5227 1.4948 1.0876 1.0823 1.0883 1.9875 7.0880 1.0382 1.0816 1.0839 1.0655 1.0638 1.0843 1.0860 1.0597 1.0977 1.0987 1.1081 1.0639 1.0771 1.0650 1.0648 1.0650 1.0666
irintensity: 0.4724 1.0694 2.0447 5.0659 2.0113 5.5501 5.7078 4.5114 8.1555 0.5729 2.6538 1.0063 8.5662 34.4664 4.8764 6.4187 3.6849 11.8960 31.7407 42.1844 3.1350 2.2268 6.4973 100.2548 217.9866 13.9464 141.9939 50.3015 138.9335 59.8692 5.3985 59.2249 42.4331 62.2367 0.6821 8.9221 42.2892 8.1263 12.7629 29.5787 9.5770 58.2865 25.0836 155.3684 57.8132 30.2016 14.9775 69.8972 9.1487 3.1412 33.1275 13.8876 6.6988 88.7058 12.8038 25.6763 5.6822 39.3970 138.5048 16.9761 68.8667 16.6075 1.9224 7.1191 26.8419 18.9847 83.1085 15.5392 30.3221 108.8305 3.8017 15.0232 20.8869 4.0248 203.0037 175.3021 26.8668 25.3985 50.8841 35.7333 45.7531 27.8533 15.0637 16.6697 5.5603 35.8579 8.9110 116.3067 51.2639 31.4177 6.4430 31.2204 18.9365
temp: 298.150 k
press: 1.00000 atm
elementType: 16 8 8 8 8 8 8 7 6 6 6 6 6 6 6 6 1 1 1 1 1 1 1 1 1 1 1 1 1 1 1 1 1
symmnumber: 1
zpe: 683599.1 jmol-1
zpe.correction: 0.260369 hartree
zpe.thermalcorrener: 0.279523 hartree
zpe.thermalcorrenthalpy: 0.280467 hartree
zpe.thermalcorrgfe: 0.211058 hartree
zpe.sumelectzpe: -1217.867657 hartree
zpe.sumelectthermal: -1217.848502 hartree
zpe.sumelectthermalent: -1217.847558 hartree
zpe.sumelectthermalfe: -1217.916968 hartree
dipole: 1.0847 -0.6659 0.2250
dipole: 1.2926
quadrupole: -83.0264 -117.8411 -107.3623
quadrupole: -9.6626 -16.6379 0.9665
quadrupole: 19.7169 -15.0979 -4.6190 -9.6626 -16.6379 0.9665
hfenergy: -1218.1280257 hartree
pointgroup: C01 [X(C8H17N1O6S1)]
dipole: 0.3908516 0.2426645 -0.2166869 debye
polarizability: 151.9074002|6.0508756|132.8111223|1.7684417|-6.702416|105.6573294 unknown
InChI: InChI=1S/C8H17NO6S/c10-3-4(11)5(12)6(13)7(14)8(15)9-1-2-16/h4-7,9-14,16H,1-3H2
charge 0 multiplicity 1
33 atoms
S  3.535363 2.660821 -1.092132
O  -2.155728 0.189519 -1.957131
O  0.441963 -0.466859 -1.441425
O  -4.259997 -0.282798 -0.183127
O  -0.456392 -1.963102 1.189002
O  -4.108664 1.87489 1.52474
O  2.161093 -1.909897 1.170254
N  2.363356 0.395396 0.855593
C  -1.865012 -0.40845 -0.639801
C  -0.410216 -0.005664 -0.341669
C  -2.916376 0.037005 0.394689
C  0.096026 -0.636149 0.980565
C  -2.971954 1.548926 0.664902
C  1.643941 -0.758645 1.001263
C  3.81731 0.392692 0.6398
C  4.16329 0.891172 -0.774814
H  -1.894621 -1.514492 -0.710012
H  -0.351219 1.104534 -0.271422
H  -2.77556 -0.520034 1.340004
H  -0.224098 0.012134 1.822855
H  -2.076911 1.878293 1.21918
H  -3.020021 2.095468 -0.299383
H  -3.12433 0.049125 -2.127642
H  -0.061128 -0.289153 -2.280956
H  1.880714 1.264413 0.601991
H  -4.491566 -1.222285 0.023537
H  0.338177 -2.579076 1.211224
H  4.317955 1.018973 1.403477
H  4.161068 -0.649016 0.769031
H  -4.898942 1.432852 1.115565
H  5.250094 0.87155 -0.953205
H  3.651155 0.282404 -1.536526
H  4.413031 3.284253 -0.217325
