program: Gaussian 09
title: 000151146
version: EM64L-G09RevD.01
frameworkgroup: C1[X(C6H15BrN)]
method: RPBEPBE
basis: SDD
operation: Freq
keyword: #p
keyword: freq=noraman
keyword: PBEPBE/SDD
title: #p freq=noraman PBEPBE/SDD
converged: YES YES NO NO
title: Mulliken charges:
elementType: Br N C C C C C C H H H H H H H H H H H H H H H
charge: 0.073724 -0.114353 -0.322348 -0.360666 -0.540705 -0.552228 -0.551623 -0.699784 0.266708 0.266989 0.258458 0.257716 0.270502 0.269016 0.270555 0.277639 0.266242 0.271184 0.276775 0.271131 0.266423 0.289225 0.289422
chargesum: 1.00000
title: Mulliken charges with hydrogens summed into heavy atoms:
elementType: Br N C C C C C C
charge: 0.073724 -0.114353 0.211349 0.155508 0.269368 0.262836 0.262705 -0.121137
polarizability: 1.10614052e+02 -8.05782036e+00 7.23870078e+01 2.02316378e-02 1.32877033e-03 6.52868708e+01
1716.lowfreq: -0.0007 -0.0006 -0.0006 7.4353 10.2476 20.3027 43.0601 73.9139 96.4219
frequency: 42.9473 73.8030 96.4002 117.7610 203.1242 203.7950 271.8331 273.6212 287.3838 345.0058 375.6582 431.5291 445.5371 496.4425 629.1931 739.9102 760.2119 831.7403 873.7624 927.6251 936.9805 1023.5092 1038.4213 1046.1873 1049.9796 1090.2995 1112.6429 1161.2833 1213.9489 1234.5563 1243.2393 1250.6929 1296.6904 1322.6632 1323.6814 1374.7800 1424.0892 1426.6712 1448.1956 1455.4354 1456.6300 1462.1165 1468.8014 1471.0152 1481.3644 1488.7177 1490.3724 1503.0078 3012.4016 3020.1872 3025.6530 3029.2947 3032.6290 3052.9415 3071.7700 3095.0922 3136.2513 3141.9591 3143.2200 3145.5886 3148.3213 3156.2052 3159.8600
redmass: 2.4283 2.3359 4.5128 1.7987 3.9530 1.2332 1.5098 1.1084 1.5855 2.2172 2.6303 2.2658 2.7713 2.7905 5.0350 4.1400 1.0924 1.3154 3.3618 2.5523 2.8523 1.2551 3.0931 1.1991 3.4397 1.1607 1.4655 1.3019 1.5547 1.6818 1.3578 1.7845 1.1861 1.3003 1.1989 1.2896 1.1489 1.1436 1.0964 1.0455 1.0793 1.1145 1.0401 1.0669 1.0880 1.0526 1.0580 1.0582 1.0596 1.0566 1.0331 1.0323 1.0340 1.0566 1.1051 1.1073 1.1114 1.1055 1.1059 1.1053 1.1053 1.1053 1.1048
irintensity: 0.9167 0.0073 2.5928 0.0122 4.5926 0.3982 0.2118 0.0062 0.1438 0.1054 0.6410 0.0944 2.3708 1.4990 12.3832 5.4613 13.9337 0.0334 33.1295 17.6051 17.5755 0.7491 0.7145 0.0220 11.8735 0.5918 2.2342 0.6439 1.7712 0.8454 14.5481 3.3640 2.2755 34.5446 0.4552 4.2049 16.1806 21.9853 2.1210 1.2858 0.2855 10.9919 1.0988 0.2097 0.9819 40.1418 64.1443 85.9979 4.9715 9.1662 4.0780 2.5791 1.5188 15.3877 0.4061 9.6277 6.9184 0.8375 0.1745 4.1543 8.3765 0.5703 5.4949
temp: 298.150 k
press: 1.00000 atm
elementType: 35 7 6 6 6 6 6 6 1 1 1 1 1 1 1 1 1 1 1 1 1 1 1
symmnumber: 1
zpe: 544866.9 jmol-1
zpe.correction: 0.207529 hartree
zpe.thermalcorrener: 0.218293 hartree
zpe.thermalcorrenthalpy: 0.219237 hartree
zpe.thermalcorrgfe: 0.169898 hartree
zpe.sumelectzpe: -304.899880 hartree
zpe.sumelectthermal: -304.889116 hartree
zpe.sumelectthermalent: -304.888172 hartree
zpe.sumelectthermalfe: -304.937511 hartree
dipole: -12.8840 0.6192 -0.0013
dipole: 12.8989
quadrupole: -23.1896 -51.3451 -52.5689
quadrupole: 1.2239 -0.0051 0.0028
quadrupole: 19.1783 -8.9772 -10.2010 1.2239 -0.0051 0.0028
hfenergy: -305.1074084 hartree
pointgroup: C01 [X(C6H15Br1N1)]
dipole: -5.0623001 -0.3536643 0.0405656 debye
dipolederiv: -0.3633466 -0.0126596 0.0021756 -0.1147296 -0.1128439 0.002806 0.0066818 0.0022717 -0.0622388 -0.5164501 -0.0252836 0.0023793 -0.0201278 -0.3290757 0.0008251 0.0026658 0.0010954 -0.3113918 0.4854137 -0.1344879 0.0061964 -0.0663503 0.1960574 -0.0032083 0.0030883 -0.0022103 0.1413012 -0.2325401 0.0601409 -0.0006593 -0.0507576 -0.0506977 0.0080246 0.0051428 0.0070557 0.1164803 0.1979372 0.1248504 -0.0089366 0.2104537 0.1939512 -0.0092671 -0.0137886 -0.0085651 0.067866 0.0409336 -0.0143082 -0.0152791 -0.0139958 0.1476964 0.1228296 -0.0488829 0.1244345 0.2292504 0.041596 -0.0133673 0.0199888 -0.0098818 0.1180797 -0.1088777 0.0533294 -0.110303 0.2576562 0.6114888 0.1559281 -0.0098877 0.1486539 0.2085392 -0.0055836 -0.0094186 -0.0058196 0.0976511 0.0449475 -0.0043226 -0.0361245 -0.002452 0.0322972 -0.0625023 -0.0400426 -0.0954978 -0.0064492 0.0447779 -0.0001767 0.0357855 0.0022651 0.0490023 0.0561349 0.0393352 0.0889728 -0.0236384 0.099507 -0.0013977 0.0261639 0.0063686 -0.0012522 -0.0766241 0.0411018 -0.0792489 -0.0169173 0.0994283 -0.0020833 -0.0276065 0.0040516 0.0124376 0.0747407 -0.0442739 0.0771272 -0.0303741 0.1017389 0.0131483 -0.0691516 -0.0200067 0.0852778 0.0415863 -0.0255149 0.0762052 -0.0066721 -0.0090481 0.0284731 -0.0008938 0.0889643 0.0210985 0.0064725 -0.0045902 0.00689 0.1333909 0.1032681 0.0204727 0.0656483 -0.0174798 0.0692484 -0.0509183 0.0262687 -0.0860296 0.0082731 0.0496808 -0.1009928 0.0133144 -0.0892959 0.0642545 -0.0063775 0.0440626 0.0190388 0.079233 -0.0365414 0.0711166 -0.0057433 0.0297165 0.1061524 -0.0190339 -0.0561823 0.003041 0.0949329 0.141115 0.0195314 -0.02652 0.0145013 0.0181694 0.0913171 -0.0189093 0.0305907 0.0201015 0.0494082 -0.1026763 -0.000056 -0.0939264 0.062409 0.0096658 -0.0321998 -0.0163297 0.0813449 0.1416383 0.0228553 0.023025 0.0162766 0.0033722 -0.0896476 0.0158798 -0.0287351 0.0346897 -0.0359697 0.0708637 -0.0015936 0.0362995 0.1084206 0.0170011 0.0534726 -0.0052757 0.0925302 -0.0289831 -0.0854571 0.0495223 -0.0283649 0.0056038 0.0760146 0.0143256 0.0887684 -0.0057477 -0.0300004 -0.0901674 -0.0417476 -0.0301824 -0.0081982 -0.0753779 -0.0115513 -0.0874765 0.0087282 unknown
polarizability: 110.2397492|8.8721805|72.7423926|-0.6239832|-0.365195|65.3057888 unknown
InChI: InChI=1S/C6H15BrN/c1-8(2,3)6-4-5-7/h4-6H2,1-3H3
charge 1 multiplicity 1
23 atoms
Br 4.053768 0.299683 -0.038183
N  -1.469084 0.078524 -0.001487
C  -0.139514 -0.726054 0.038409
C  1.145841 0.122593 -0.013136
C  -2.625124 -0.9235 0.069207
C  -1.565535 1.030483 1.190767
C  -1.583701 0.874743 -1.301417
C  2.375329 -0.807536 0.01824
H  -0.185305 -1.421154 -0.819425
H  -0.177962 -1.321525 0.968455
H  1.209812 0.80973 0.848737
H  1.194291 0.728532 -0.934958
H  -2.550752 -1.494652 1.007124
H  -3.579771 -0.376421 0.041384
H  -2.563052 -1.607851 -0.79063
H  -0.78494 1.799737 1.113126
H  -2.556607 1.509254 1.181614
H  -1.4367 0.45672 2.12132
H  -0.806414 1.65072 -1.329136
H  -1.461915 0.190529 -2.155011
H  -2.577053 1.347193 -1.340358
H  2.439949 -1.395979 0.946737
H  2.428739 -1.471171 -0.85878
